{"text_format":"1","workbook":"xlsx","n_sheets":5,"sheets":["Istruzioni","Input tabelle","Criticità & Indicatori","Alternative & Selezioni","Cronoprogramma 2016-2019"],"not_rendered":{"charts":0,"images":1,"macros":1,"external_links":0,"defined_names":1,"comments":0,"pivot_tables":0},"unopened":[],"bounds":{"document_bytes":16777216,"sheet_cells":100000,"rows_first":2000,"rows_last":500,"rows_between":2000,"halvings":0,"cell_chars":16384,"cell_head_chars":4096},"cells_cut":0,"cells_raw":0,"read":"whole","date_system":"1900"}

{"sheet":"Istruzioni","index":0,"n_rows":65,"n_cols":4,"rows_kept":65,"cut":false,"hidden":false,"merged":[[34,2,34,3],[48,2,48,3],[8,2,8,3],[13,2,13,3],[20,2,20,3],[29,2,30,2],[29,3,30,3]]}
[]
[null,null,"Istruzioni per la compilazione  della Mappa criticità-interventi"]
[null,null,"La “Mappa criticità-interventi” (di seguito Mappa) è costituita da cinque fogli di  calcolo, di cui solo tre sono compilabili dall’utente (evidenziati dalla linguetta della scheda di colore  blu)."]
[null,null,"·         Foglio “Istruzioni”"]
[null,null,"·         Foglio “Input tabelle”"]
[null,null,"·         Foglio “Criticità & Indicatori” (compilabile)"]
[null,null,"·         Foglio “Alternative & Selezioni” (compilabile)"]
[null,null,"·         Foglio “Cronoprogramma 2016-2019” (compilabile)"]
[null,null,"Il colore della cella ad intestazione di ciascuna tabella indica se il dato si riferisce alla precedente programmazione 2014-2017 o alla nuova programmazione 2016-2019"]
[null,null,null,"Dati PdI 2016-2019"]
[null,null,null,"Dati PdI 2014-2017"]
[]
[null,null,"1. Intestazione dei fogli di calcolo"]
[null,null," In ciascun foglio della Mappa, in testa alle tabelle, è presente una sezione di informazioni generali dove si chiede l' indicazione di ATO, Ente di Governo d’Ambito e Soggetto Gestore per il quale è stata fatta la predisposizione tariffaria, con i rispettivi codici identificativi (ID) assegnati in sede di registrazione nell’anagrafica dell’AEEGSI. Compilando questa sezione nel primo foglio della Mappa (Criticità & Indicatori), le medesime informazioni verranno automaticamente aggiornate negli altri due fogli compilabili. "]
[]
[]
[]
[]
[]
[null,null,"2. Voci foglio di calcolo \"Criticità & Indicatori\""]
[null,null,"Questo foglio di calcolo è organizzato in modo tale da raccogliere le informazioni più puntuali richieste ai Capitoli 2 e 3 dello schema tipo di cui all'Allegato A alla determina 2/2016/DSID. Ciascuna riga compilabile della tabella corrisponde ad una criticità individuata dall'EGA (è stato previsto un numero di righe sufficiente a raccogliere eventualmente tutte le criticità possibili). Per criticità ancora sussistenti ripetto alla precedente pianificazione (2014-2017), sono previsti appositi riferimenti (es. \"Criticità AEEGSI ex-determina 3/2014/DSID\" e \"Valori obiettivo PdI 2014-2017\").  "]
[null,null,"Di seguito alcune informazioni più puntuali su specifiche voci del foglio "]
[]
[null,null,"Criticità AEEGSI e sotto-area criticità 2016-2019 ex determina 2/2016/DSID","Inserire il codice delle criticità specifiche e delle sotto-aree corrispondenti utilizzando esclusivamente il menù a tendina predisposto"]
[null,null,"Criticità AEEGSI ex determina 3/2014/DSID","Inserire il codice delle criticità utilizzando esclusivamente il menù a tendina predisposto"]
[null,null,"Località interessata/e criticità","Indicare i confini amministrativi ( es. Comune/i, Provincia/e, ATO) o geografici (es. valle, pianura, bacino)"]
[null,null,"Popolazione interessata criticità (ab.)","Coerentemente alla località interessata dalla criticità, dare evidenza del numero di abitanti interessati (effettivamente rilevati o stimati o eventualmente facendo riferimento ai dati Istat)."]
[null,null,"rilevata/stimata","Nella valutazione della popolazione interessata dalla criticità, si distingue se il dato è rilevato o stimato "]
[null,null,"Indicatore di performance utilizzato","Nome dell'indicatore o breve descrizione (es. \"Stato degli impianti\")"]
[null,null,"Formula [Unità di misura]","Es. \"popolazione servita/popolazione totale (%)\""]
[]
[null,null,"Grado di attendibilità indicatore","La valutazione del grado di attendibilità segue l'omonima classificazione per codice numerico contenuta nello Schema-tipo. Il valore 1 raccoglie tutti gli indicatori costituiti da grandezze effettivamente rilevate, il valore 2 raccoglie gli indicatori \"ibridi\" (costruiti a partire da grandezze in parte stimate o riprese dalla letteratura tecnica-scientifica), mentre il valore 3 riguarda gli indicatori costituiti da sole grandezze stimate."]
[]
[null,null,"3. Voci foglio di calcolo \"Alternative & Selezione\""]
[null,null,"In questo foglio di calcolo sono raccolte le informazioni contenute nel Capitolo 4 dello Schema-tipo (\"Strategie di intervento ed analisi delle opzioni progettuali\"). Come per il foglio precedente, anche in questa tabella ciascuna riga rappresenta la criticità individuata (eventualmente replicata più volte in caso siano selezionati più interventi per risolverla), per la quale è stata condotta l'analisi delle opzioni alternative. In via previsionale, sono state inserite fino a un massimo di 10 opzioni progettuali alternative percorribili. [Nota: può accadere sia che per piu' criticita' venga selezionato il medesimo intervento, sia che per la stessa criticita' vengano selezionati piu' interventi riportati su più righe]"]
[null,null,"Di seguito alcune informazioni più puntuali su specifiche voci del foglio "]
[]
[null,null,"ID Intervento pianificato","Indicare un numero progressivo (1,2,3,..) che permetta di identificare univocamente ciascun singolo intervento soggetto ad analisi delle opzioni alternative."]
[null,null,"Titolo intervento","Si richiede un’indicazione sintetica, eventualmente anche mediante l’utilizzo di parole chiave (es. realizzazione nuovo potabilizzatore, efficientamento impianto sollevamento etc.)."]
[null,null,"Costo totale intervento","Si chiede di indicare il costo totale dell'intervento previsto per il quadriennio 2016-2019. "]
[null,null,"Popolazione interessata intervento (ab)","Dare evidenza del numero di abitanti interessati dall'intervento (effettivamente rilevati, stimati o eventualmente facendo riferimento ai dati Istat). In coerenza con la voce \"Popolazione interessata dalla criticità\", tale valore non può essere maggiore di quest'ultimo."]
[null,null,"Livello obiettivo finale","Si intende il livello obiettivo che si prevede raggiungere a conclusione dell'intervento pianificato."]
[null,null,"Opzione 0","Definire in questa voce (se considerata) solo la situazione in assenza di realizzazione dell'intervento."]
[null,null,"Costo previsto opzione 0","La misura del costo dell'Opzione 0 ad esempio può essere espressa in termini di costo potenziale (es. costo della multa) o in termini di costo per manutenzioni straordinarie."]
[null,null,"Opzione n","Come per la voce dell'intervento pianificato, si richiede un'indicazione sintetica o per parole chiave delle opzioni progettuali alternative. Con riferimento al costo, alla popolazione interessata, al livello obiettivo, vedere le medesime voci specificate per l'intervento."]
[]
[]
[null,null,"4. Voci foglio di calcolo \"Cronoprogramma 2016-2019\""]
[null,null,"Questo foglio rappresenta la sintesi della fase conclusiva del procedimento di pianificazione degli interventi per il quadriennio 2016-2019, la cui descrizione è contenuta nel Capitolo 5 dello Schema-tipo. Il foglio dà altresì evidenza degli eventuali scostamenti di cui al Capitolo 6 (sia con riferimento agli investimenti realizzati negli anni 2014-2015 che programmati negli anni 2016-2017). Rispetto ai fogli precedenti, la logica di allocazione delle criticità e dei costi nel Cronoprogramma 2016-2019 avviene per singolo intervento. La tabella contiene 250 righe, ma viene concessa  la possibilità di aggiungere o eliminare righe tramite appositi pulsanti (non è possibile aggiungere righe manualmente). [Nota: nel caso in cui un intervento risolva più criticità, occorre replicarlo su più righe in numero corrispondente alle criticità risolte]"]
[null,null,"Di seguito alcune informazioni più puntuali su specifiche voci del foglio "]
[]
[null,null,"ID Intervento pianificato","Indicare un numero progressivo (1,2,3,..) che permetta di identificare univocamente ciascun singolo intervento soggetto ad analisi delle opzioni alternative, in coerenza con la rispettiva voce del foglio \"Alternative & Selezioni\". Nel caso in cui nel Cronoprogramma si sia reso necessario scorporare l'intervento in n sotto-interventi (ad esempio a livello territoriale), in ragione della differente entrata in esercizio, l'ID di riferimento dovrà essere scomposto in maniera coerente (es. 1.1, 1.2, 1.3,.., 1.n). "]
[null,null,"Titolo intervento","Deve coincidere con quella indicata nel foglio \"Alternative & Selezioni\"."]
[null,null,"Intervento presente nel PdI 2014-2017?","Indicare se l'intervento riportato era già stato programmato nel precedente PdI 2014-2017; la scelta è limitata da un apposito menù a tendina. "]
[null,null,"Popolazione interessata criticità (ab)","Deve coincidere con l'omonimo valore indicato nel foglio \"Criticità & Indicatori\"."]
[null,null,"Rilevata/stimata","Segue lo stesso sistema di valutazione del \"Grado di affidabilità popolazione criticità\" contenuto nel foglio \"Criticità & Indicatori\"."]
[null,null,"Località interessata/e criticità","Indicare i confini amministrativi ( es. Comune/i, Provincia/e, ATO) o geografici (es. valle, pianura, bacino) su cui impatta l'intervento selezionato. Non deve/devono essere più estesa/e dell'area che subisce la criticità."]
[null,null,"Iter autorizzativo concluso?","Fa riferimento all’eventuale necessità di permessi, nulla osta, altre eventuali autorizzazioni. Nel caso l’intervento non necessiti di alcuna autorizzazione, selezionare la voce N.A. (non applicabile)."]
[null,null,"Stadio di progettazione/esecuzione","Indica il livello di maturità degli interventi pianificati; la scelta è  limitata da un apposito menù a tendina."]
[null,null,"Livello obiettivo PdI 2014-2017 ","Tale valore si riferisce agli anni 2016 e 2017; se non si dispone del valore disaggregato per i due anni di pianificazione compilare solo la cella relativa all'anno cui fa riferimento il valore obiettivo finale dell'indicatore. "]
[null,null,"Livello obiettivo PdI 2016-2019 ","Se non si dispone del valore disaggregato per i quattro anni di pianificazione compilare solo la cella relativa all'anno cui fa riferimento il valore obiettivo finale dell'indicatore. "]
[null,null,"Post-2019","Questa voce si applica nell'eventualità in cui la risoluzione della criticità sia prevista in un anno successivo al 2019, così come il raggiungimento del valore obiettivo. In questo caso si richiede anche di indicare l'anno di raggiungimento di tale valore (la cella \"Anno?\" è compilabile)."]
[null,null,"Investimento realizzato","Tale voce fa riferimento alla realizzazione degli interventi la cui spesa nel precedente ciclo di pianificazione (2014-2017) era stata imputata nel solo biennio 2014-2015, in coerenza con l'art. 11 dell'Allegato A alla delibera 664/2015/R/IDR."]
[null,null,"Investimento pianificato PdI 2014-2017","Tale voce fa riferimento agli investimenti che nel precedente PdI erano stati pianificati negli anni 2016 e 2017, che si sovrappongono con i primi due anni del nuovo ciclo di pianificazione. "]
[null,null,"Investimento pianificato PdI 2016-2019","E’ possibile imputare solo l’importo per le singole annualità. Il foglio elabora automaticamente la somma sia per la quota finanziata con tariffa sia per la quota finanziata con contributo pubblico."]

{"sheet":"Input tabelle","index":1,"n_rows":142,"n_cols":9,"rows_kept":142,"cut":false,"hidden":false,"merged":[[34,8,35,8],[3,8,4,8],[1,2,1,8],[9,8,10,8],[16,8,17,8],[23,8,24,8]]}
[]
[null,null,"Input fogli di calcolo"]
[]
[null,null,"Criticità AEEGSI ex determina 2/2016/DSID",null,"Sotto-area 2016-2019 ex determina 2/2016/DSID",null,"Criticità AEEGSI  ex determina 3/2014/DSID",null,"Grado di affidabilità popolazione"]
[null,null,"K1.1"]
[null,null,"K1.1",null,"K1",null,"A1",null,"rilevata"]
[null,null,"K2.1",null,"K2",null,"A2",null,"stimata"]
[null,null,"K3.1",null,"K3",null,"A3"]
[null,null,"K4.1",null,"K4",null,"A4"]
[null,null,"K5.1",null,"K5",null,"A5",null,"Grado di affidabilità indicatore "]
[null,null,"A1.1",null,"A1",null,"B1"]
[null,null,"A1.2",null,"A2",null,"B2",null,1]
[null,null,"A1.3",null,"A3",null,"B3",null,2]
[null,null,"A1.4",null,"A4",null,"B4",null,3]
[null,null,"A2.1",null,"A5",null,"B5"]
[null,null,"A2.2",null,"A6",null,"B6"]
[null,null,"A3.1",null,"A7",null,"B7",null,"Iter autorizzativo concluso?"]
[null,null,"A3.2",null,"A8",null,"B8"]
[null,null,"A4.1",null,"A9",null,"C1",null,"SI"]
[null,null,"A4.2",null,"A10",null,"C2",null,"NO"]
[null,null,"A4.3",null,"P1",null,"C3",null,"N.A."]
[null,null,"A5.1",null,"P2",null,"C4"]
[null,null,"A5.2",null,"P3",null,"C5"]
[null,null,"A5.3",null,"P4",null,"D1",null,"Stadio di progettazione/esecuzione"]
[null,null,"A6.1",null,"P5",null,"D2"]
[null,null,"A7.1",null,"P6",null,"D3",null,"Scheda progetto"]
[null,null,"A7.2",null,"P7",null,"D4",null,"Studio di fattibilità"]
[null,null,"A7.3",null,"B1",null,"E1",null,"Progetto preliminare"]
[null,null,"A7.4",null,"B2",null,"E2",null,"Progetto definitivo"]
[null,null,"A7.5",null,"B3",null,"E3",null,"Progetto esecutivo"]
[null,null,"A8.1",null,"B4",null,"E4",null,"Lavori aggiudicati"]
[null,null,"A8.2",null,"B5",null,"E5",null,"Lavori in corso"]
[null,null,"A9.1",null,"B6",null,"F1"]
[null,null,"A9.2",null,"B7",null,"F2"]
[null,null,"A10",null,"B8",null,"F3",null,"Intervento presente nel PdI 2014-2017?"]
[null,null,"P1.1",null,"B9",null,"F4"]
[null,null,"P1.2",null,"B10",null,"F5",null,"Sì"]
[null,null,"P1.3",null,"B11",null,"F6",null,"No"]
[null,null,"P1.4",null,"C1",null,"F7"]
[null,null,"P1.5",null,"C2",null,"F8"]
[null,null,"P1.6",null,"C3",null,"G1"]
[null,null,"P1.7",null,"C4",null,"G2"]
[null,null,"P1.8",null,"C5",null,"G3"]
[null,null,"P2.1",null,"C6",null,"G4"]
[null,null,"P2.2",null,"C7",null,"G5"]
[null,null,"P2.3",null,"C8"]
[null,null,"P3.1",null,"D1"]
[null,null,"P3.2",null,"D2"]
[null,null,"P4.1",null,"D3"]
[null,null,"P4.2",null,"D4"]
[null,null,"P4.3",null,"D5"]
[null,null,"P5.1",null,"D6"]
[null,null,"P5.2",null,"G1"]
[null,null,"P6.1",null,"G2"]
[null,null,"P6.2",null,"G3"]
[null,null,"P7.1",null,"G4"]
[null,null,"B1.1",null,"G5"]
[null,null,"B1.2",null,"M1"]
[null,null,"B1.3",null,"M2"]
[null,null,"B1.4",null,"M3"]
[null,null,"B1.5",null,"M4"]
[null,null,"B2.1",null,"M5"]
[null,null,"B3.1"]
[null,null,"B4.1"]
[null,null,"B4.2"]
[null,null,"B5.1"]
[null,null,"B6.1"]
[null,null,"B6.2"]
[null,null,"B6.3"]
[null,null,"B7.1"]
[null,null,"B8.1"]
[null,null,"B9.1"]
[null,null,"B9.2"]
[null,null,"B10.1"]
[null,null,"B10.2"]
[null,null,"B11.1"]
[null,null,"C1.1"]
[null,null,"C2.1"]
[null,null,"C2.2"]
[null,null,"C2.3"]
[null,null,"C2.4"]
[null,null,"C2.5"]
[null,null,"C2.6"]
[null,null,"C2.7"]
[null,null,"C2.8"]
[null,null,"C2.9"]
[null,null,"C3.1"]
[null,null,"C4.1"]
[null,null,"C4.2"]
[null,null,"C5.1"]
[null,null,"C6.1"]
[null,null,"C6.2"]
[null,null,"C7.1"]
[null,null,"C7.2"]
[null,null,"C8.1"]
[null,null,"D1.1"]
[null,null,"D1.2"]
[null,null,"D1.3"]
[null,null,"D1.4"]
[null,null,"D1.5"]
[null,null,"D2.1"]
[null,null,"D2.2"]
[null,null,"D2.3"]
[null,null,"D2.4"]
[null,null,"D2.5"]
[null,null,"D2.6"]
[null,null,"D2.7"]
[null,null,"D2.8"]
[null,null,"D2.9"]
[null,null,"D2.10"]
[null,null,"D3.1"]
[null,null,"D3.2"]
[null,null,"D4.1"]
[null,null,"D4.2"]
[null,null,"D4.3"]
[null,null,"D4.4"]
[null,null,"D5.1"]
[null,null,"D5.2"]
[null,null,"D6.1"]
[null,null,"D6.2"]
[null,null,"D6.3"]
[null,null,"G1.1"]
[null,null,"G2.1"]
[null,null,"G3.1"]
[null,null,"G4.1"]
[null,null,"G5.1"]
[null,null,"M1.1"]
[null,null,"M1.2"]
[null,null,"M1.3"]
[null,null,"M1.4"]
[null,null,"M1.5"]
[null,null,"M2.1"]
[null,null,"M3.1"]
[null,null,"M4.1"]
[null,null,"M4.2"]
[null,null,"M4.3"]
[null,null,"M4.4"]
[null,null,"M4.5"]
[null,null,"M4.6"]
[null,null,"M4.7"]
[null,null,"M4.8"]
[null,null,"M5.1"]

{"sheet":"Criticità & Indicatori","index":2,"n_rows":26,"n_cols":13,"rows_kept":26,"cut":false,"hidden":false,"merged":[[5,12,6,12],[5,10,6,10],[5,7,6,7],[5,11,6,11],[5,9,6,9],[5,8,6,8],[5,1,6,1],[5,5,6,5],[5,4,6,4],[5,3,6,3],[5,6,6,6],[5,2,6,2]]}
[]
[null,"ATO","ATO2 - Lazio Centrale Roma","ID ATO",1202,null,null,"Dati PdI 2016-2019"]
[null,"Ente di Governo d'Ambito","Ambito Territoriale 2 - Lazio Centrale - Roma","ID Ente di Governo d'Ambito",19898]
[null,"Soggetto Gestore","Acea Ato2 S.p.A.","ID Soggetto Gestore",13989,null,null,"Dati PdI 2014-2017"]
[]
[null,"Criticità AEEGSI ex determina 2/2016/DSID","Sotto-area 2016-2019 ex determina 2/2016/DSID","Criticità AEEGSI  ex determina 3/2014/DSID","Località interessata/e criticità","Popolazione interessata criticità PdI 2016-2019 (ab.)","Rilevata/ Stimata","Incidenza su pop. Totale ATO (%)","Indicatore di performance utilizzato","Formula \n[Unità di misura]","Grado di attendibilità indicatore","Livello attuale al 31-12-2015","Livello obiettivo PdI (2014-2017)"]
[]
[null,"A1.1","A1","A5","Fiano Romano, Velletri, Saracinesco",14790,"stimata",4.1083333333333336E-3,"Volume degli investimenti","Importo eseguito/Importo previsto [%]",1,0]
[null,"A1.2","A1","B2","Vari Comuni  ATO2",288310,"stimata",8.0086111111111108E-2,"Volume degli investimenti","Importo eseguito/Importo previsto [%]",1,0]
[null,"A4.1","A4","A1","Intero Territorio ATO2 gestito",3600000,"stimata",1,"Volume degli investimenti","Importo eseguito/Importo previsto [%]",2,0]
[null,"A4.2","A4","A4","Intero Territorio ATO2 gestito",3600000,"stimata",1,"Volume degli investimenti","Importo eseguito/Importo previsto [%]",1,0]
[null,"B1.1","B1","B1","Intero Territorio ATO2 gestito",3600000,"stimata",1,"Tasso di rinnovo","Lunghezza rete bonificata/Lunghezza obiettivo [%]",2,5]
[null,"B7.1","B7","A1","Vari Comuni  ATO2",30000,"stimata",8.3333333333333332E-3,"Tasso di estensione","Lunghezza rete distribuzione posata/Lunghezza obiettivo [%]",2,8]
[null,"B8.1","B8","A5","Vari Comuni ATO2",1040700,"stimata",0.28908333333333336,"Volume degli investimenti","Importo eseguito/Importo previsto [%]",1,0]
[null,"C1.1","C1","C1","Vari Comuni  ATO2",86000,"stimata",2.388888888888889E-2,"Tasso di estensione","Lunghezza rete posata/Lunghezza obiettivo [%]",2,3]
[null,"C2.1","C2","C2","Intero Territorio ATO2 gestito",3600000,"stimata",1,"Tasso di rinnovo","Lunghezza rete bonificata/Lunghezza obiettivo [%]",2,4]
[null,"D1.1","D1","D1","Vari Comuni ATO2",2236900,"stimata",0.62136111111111114,"numero depuratori saturi","Impianti senza capacità residua [n°]",2,47]
[null,"D1.1","D1","D1","Vari Comuni ATO2",69243,"stimata",1.9234166666666667E-2,"abitanti non depurati","Abitanti allacciati alla pubblica fognatura ma non depurati [n°]",2,69243]
[null,"D2.4","D2","D4","Vari Comuni ATO2",172550,"stimata",4.7930555555555553E-2,"Volume degli investimenti","Importo eseguito/Importo previsto [%]",1,0]
[null,null,"D2","D2","Intero Territorio ATO2 gestito",3600000,"stimata",1,"Volume degli investimenti","Importo eseguito/Importo previsto [%]",1,0]
[null,"D6.3","D6","D3","Vari Comuni  ATO2",1170200,"stimata",0.32505555555555554,"Volume degli investimenti","Importo eseguito/Importo previsto [%]",1,0]
[null,"D6.3","D6","D4","Vari Comuni  ATO2",1170200,"stimata",0.32505555555555554,"Volume degli investimenti","Importo eseguito/Importo previsto [%]",1,0]
[null,null,"M4","E3","Roma",2600000,"stimata",0.72222222222222221,"Volume degli investimenti","Importo eseguito/Importo previsto [%]",1,0]
[null,"B10.2","B10","F4","Intero Territorio ATO2 gestito",3600000,"stimata",1,"Misuratori di utenza sostituiti","Misuratori di utenza sostituiti (n.)",1,0]
[null,"M1.1","M1",null,"Intero Territorio ATO2 gestito",3600000,"stimata",1,"Impianti in telecontrollo","Percentuale impianti telecontrollati (%)",1,47]
[null,"M5.1","M5",null,"Intero Territorio ATO2 gestito",3600000,"stimata",1,"Volume degli investimenti","Importo eseguito/Importo previsto [%]",1,0]

{"sheet":"Alternative & Selezioni","index":3,"n_rows":28,"n_cols":51,"rows_kept":28,"cut":false,"hidden":false,"merged":[[5,8,6,8],[5,9,6,9],[5,10,6,10],[5,25,6,25],[5,11,6,11],[5,12,6,12],[5,13,6,13],[5,15,6,15],[5,16,6,16],[5,17,6,17],[5,19,6,19],[5,20,6,20],[5,21,6,21],[5,23,6,23],[5,24,6,24],[5,6,6,6],[5,1,6,1],[5,3,6,3],[5,4,6,4],[5,5,6,5],[5,2,6,2],[5,27,6,27],[5,28,6,28],[5,29,6,29],[5,31,6,31],[5,32,6,32],[5,46,6,46],[5,33,6,33],[5,35,6,35],[5,36,6,36],[5,37,6,37],[5,39,6,39],[5,34,6,34],[5,38,6,38],[5,50,6,50],[5,7,6,7],[5,14,6,14],[5,18,6,18],[5,22,6,22],[5,26,6,26],[5,30,6,30],[5,47,6,47],[5,48,6,48],[5,49,6,49],[5,40,6,40],[5,41,6,41],[5,43,6,43],[5,44,6,44],[5,45,6,45],[5,42,6,42]]}
[]
[null,"ATO",{"$f":"IF('Criticità & Indicatori'!C2=0,\"\",'Criticità & Indicatori'!C2)","v":"ATO2 - Lazio Centrale Roma"},"ID ATO",{"$f":"IF('Criticità & Indicatori'!E2=0,\"\",'Criticità & Indicatori'!E2)","v":1202},null,null,"Dati PdI 2016-2019"]
[null,"Ente di Governo d'Ambito",{"$f":"IF('Criticità & Indicatori'!C3=0,\"\",'Criticità & Indicatori'!C3)","v":"Ambito Territoriale 2 - Lazio Centrale - Roma"},"ID Ente di Governo d'Ambito",{"$f":"IF('Criticità & Indicatori'!E3=0,\"\",'Criticità & Indicatori'!E3)","v":19898}]
[null,"Soggetto Gestore",{"$f":"IF('Criticità & Indicatori'!C4=0,\"\",'Criticità & Indicatori'!C4)","v":"Acea Ato2 S.p.A."},"ID Soggetto Gestore",{"$f":"IF('Criticità & Indicatori'!E4=0,\"\",'Criticità & Indicatori'!E4)","v":13989},null,null,"Dati PdI 2014-2017"]
[]
[null,"Criticità AEEGSI ex determina 2/2016/DSID","Sotto-area 2016-2019 ex determina 2/2016/DSID","ID intervento pianificato","Titolo Intervento pianificato","Costo totale intervento","Popolazione interessata intervento (ab.)","Livello obiettivo finale","Opzione 0\n(Titolo intervento)","Costo previsto Opzione 0","Popolazione interessata Opzione 0","Opzione 1\n(Titolo intervento)","Costo previsto Opzione 1","Popolazione interessata Opzione 1","Livello obiettivo Opzione 1","Opzione 2\n(Titolo intervento)","Costo previsto Opzione 2","Popolazione interessata Opzione 2","Livello obiettivo Opzione 2","Opzione 3\n(Titolo intervento)","Costo previsto Opzione 3","Popolazione interessata Opzione 3","Livello obiettivo Opzione 3","Opzione 4\n(Titolo intervento)","Costo previsto Opzione 4","Popolazione interessata Opzione 4","Livello obiettivo Opzione 4","Opzione 5\n(Titolo intervento)","Costo previsto Opzione 5","Popolazione interessata Opzione 5","Livello obiettivo Opzione 5","Opzione 6\n(Titolo intervento)","Costo previsto Opzione 6","Popolazione interessata Opzione 6","Livello obiettivo Opzione 6","Opzione 7\n(Titolo intervento)","Costo previsto Opzione 7","Popolazione interessata Opzione 7","Livello obiettivo Opzione 7","Opzione 8\n(Titolo intervento)","Costo previsto Opzione 8","Popolazione interessata Opzione 8","Livello obiettivo Opzione 8","Opzione 9\n(Titolo intervento)","Costo previsto Opzione 9","Popolazione interessata Opzione 9","Livello obiettivo Opzione 9","Opzione 10\n(Titolo intervento)","Costo previsto Opzione 10","Popolazione interessata Opzione 10","Livello obiettivo Opzione 10"]
[]
[null,"A4.1","A4",64,"MESSA IN SICUREZZA ACQUEDOTTO PESCHIERA",10000000,2000000,null,"MANCATO RADDOPPIO ACQUEDOTTO PESCHIERA",597596000,2000000]
[null,"D1.1","D1",430,"MAGLIANELLA VI TRONCO BY-PASS DEP.PALMAROLA (ELIM. SCARICO F51) - PROC. DI INFRAZIONE 2014/2059",7000000,100000,null,"MANCATA REALIZZAZIONE COLLETTORE MAGLIANELLA VI TRONCO",47810000,100000]
[null,"D2.4","D2",481,"DISMISSIONE DEPURATORI MONTE POZZOLANA E VALLE LINDA",2500000,3500,null,"MANCATA CENTRALIZZAZIONE IMPIANTI DI DEPURAZIONE",null,3500]
[null,"D2.4","D2",482,"COLLETTORE FOGNARIO DI ARANOVA",500000,5600,null,"MANCATA CENTRALIZZAZIONE IMPIANTI DI DEPURAZIONE",null,5600]
[null,"D2.4","D2",483,"RISANAMENTO SANITARIO DI MONTECOMPATRI E ROMA",1000000,40000,null,"MANCATA CENTRALIZZAZIONE IMPIANTI DI DEPURAZIONE",null,40000]
[null,"D2.4","D2",484,"COLLETTORE INTERCOMUNALE PER LA RACCOLTA DELLE ACQUE REFLUE E RELATIVO IMPIANTO DI DEPURAZIONE NEI TERRITORI DI CARPINETO ROMANO, GAVIGNANO, MONTELACINO - I LOTTO",1500000,6000,null,"MANCATA CENTRALIZZAZIONE IMPIANTI DI DEPURAZIONE",null,6000]
[null,"D2.4","D2",485,"ELIM. DEP.COLLE PISANO E SONNINO - MONTE PORZIO CATONE II° STRALCIO ELIMINAZIONE DEPURATORE SONNINO",1394250,5000,null,"MANCATA CENTRALIZZAZIONE IMPIANTI DI DEPURAZIONE",null,5000]
[null,"D2.4","D2",486,"ELIM. DEP.COLLE PISANO E SONNINO - MONTE PORZIO CATONE I° STRALCIO ELIM. DEPURATORE COLLE PISANO",774538.9,9600,null,"MANCATA CENTRALIZZAZIONE IMPIANTI DI DEPURAZIONE",null,9600]
[null,"D2.4","D2",487,"DISMISSIONE DEPURATORI PONTE SODO E MONTELUNGO",2103785,1000,null,"MANCATA CENTRALIZZAZIONE IMPIANTI DI DEPURAZIONE",null,1000]
[null,"D2.4","D2",488,"ADEGUAMENTO IMPIANTO FOSSO CIPPONE ED ELIMINAZIONE FOSSO IANNI",2572903,4000,null,"MANCATA CENTRALIZZAZIONE IMPIANTI DI DEPURAZIONE",null,4000]
[null,"D2.4","D2",489,"ELIMINAZIONE DEPURATORE PONTE DI NONA",468000,1000,null,"MANCATA CENTRALIZZAZIONE IMPIANTI DI DEPURAZIONE",null,1000]
[null,"D2.4","D2",490,"ELIMINAZIONE DEPURATORE NUOVA PALOCCO",1450215,1400,null,"MANCATA CENTRALIZZAZIONE IMPIANTI DI DEPURAZIONE",null,1400]
[null,"D2.4","D2",491,"ELIMINAZIONE DELL’IMPIANTO DI DEPURAZIONE CASE ROSSE DEL COMUNE DI ROMA",954037.5,10500,null,"MANCATA CENTRALIZZAZIONE IMPIANTI DI DEPURAZIONE",null,10500]
[null,"D2.4","D2",492,"ELIMINAZIONE DEPURATORE PARCO DELLA TIBURTINA",482625,900,null,"MANCATA CENTRALIZZAZIONE IMPIANTI DI DEPURAZIONE",null,900]
[null,"D2.4","D2",493,"ELIMINAZIONE DEPURATORE FINOCCHIO E COLLETTAMENTO A ROMA EST ",2000000,40000,null,"MANCATA CENTRALIZZAZIONE IMPIANTI DI DEPURAZIONE",null,40000]
[null,"D2.4","D2",494,"ELIMINAZIONE DEL DEPURATORE \"GUADO TUFO\"",500000,300,null,"MANCATA CENTRALIZZAZIONE IMPIANTI DI DEPURAZIONE",null,300]
[null,"D2.4","D2",495,"ELIMINAZIONE DEPURATORE FONTANE NUOVE ",1000000,650,null,"MANCATA CENTRALIZZAZIONE IMPIANTI DI DEPURAZIONE",null,650]
[null,"D2.4","D2",496,"COLLETTORE FOGNARIO BIVIO SAN POLO - POLVERIERA",2663018,1200,null,"MANCATA CENTRALIZZAZIONE IMPIANTI DI DEPURAZIONE",null,1200]
[null,"D2.4","D2",497,"COLLETTORE FOGNARIO CAPANNELLE - PONTE LUCANO DI TIVOLI",4177875,7100,null,"MANCATA CENTRALIZZAZIONE IMPIANTI DI DEPURAZIONE",null,7100]
[null,"D2.4","D2",498,"COLLEGAMENTO A ROMA EST DEL DEPURATORE DI BORGONOVO",1000000,33800,null,"MANCATA CENTRALIZZAZIONE IMPIANTI DI DEPURAZIONE",null,33800]
[null,"D2.4","D2",499,"ELIMINAZIONE DEPURATORE ARCI",1657500,1000,null,"MANCATA CENTRALIZZAZIONE IMPIANTI DI DEPURAZIONE",null,1000]

{"sheet":"Cronoprogramma 2016-2019","index":4,"n_rows":534,"n_cols":38,"rows_kept":534,"cut":false,"hidden":false,"merged":[[1,9,1,12],[7,32,7,33],[7,11,8,11],[6,1,6,12],[6,24,6,27],[6,28,6,37],[6,20,6,23],[7,28,7,29],[7,30,7,31],[7,36,7,37],[7,34,7,35],[6,13,6,19],[7,1,8,1],[7,26,7,27],[7,24,7,25],[7,20,7,21],[7,22,7,23],[7,15,7,18],[7,13,7,14],[7,12,8,12],[7,3,8,3],[7,2,8,2],[7,10,8,10],[7,8,8,8],[7,9,8,9],[7,7,8,7],[7,5,8,5],[7,4,8,4],[7,6,8,6]]}
[]
[null,null,null,null,null,null,null,null,null,"Aggiungi/Elimina righe",null,null,null,"N."]
[null,"ATO",{"$f":"IF('Criticità & Indicatori'!C2=0,\"\",'Criticità & Indicatori'!C2)","v":"ATO2 - Lazio Centrale Roma"},"ID ATO",{"$f":"IF('Criticità & Indicatori'!E2=0,\"\",'Criticità & Indicatori'!E2)","v":1202},null,null,"Dati PdI 2016-2019",null,null,"Aggiunge a partire dalla prima riga vuota (NB compilare le prime due righe)",null,null,119]
[null,"Ente di Governo d'Ambito",{"$f":"IF('Criticità & Indicatori'!C3=0,\"\",'Criticità & Indicatori'!C3)","v":"Ambito Territoriale 2 - Lazio Centrale - Roma"},"ID Ente di Governo d'Ambito",{"$f":"IF('Criticità & Indicatori'!E3=0,\"\",'Criticità & Indicatori'!E3)","v":19898},null,null,null,null,null,"Elimina righe vuote",null,null,1]
[null,"Soggetto Gestore",{"$f":"IF('Criticità & Indicatori'!C4=0,\"\",'Criticità & Indicatori'!C4)","v":"Acea Ato2 S.p.A."},"ID Soggetto Gestore",{"$f":"IF('Criticità & Indicatori'!E4=0,\"\",'Criticità & Indicatori'!E4)","v":13989},null,null,"Dati PdI 2014-2017",null,null,"Elimina riga compilata: selezionare la riga che si intende eliminare"]
[]
[null,"Analisi interventi",null,null,null,null,null,null,null,null,null,null,null,"Valori obiettivo ",null,null,null,null,null,null,"Investimento realizzato ",null,null,null,"Investimento pianificato PdI 2014-2017",null,null,null,"Investimento pianificato PdI 2016-2019"]
[null,"ID intervento pianificato","Titolo Intervento pianificato","Intervento presente nel PdI 2014-2017?","Sotto-area 2016-2019 ex determina 2/2016/DSID","Criticità AEEGSI ex determina 2/2016/DSID","Popolazione interessata criticità (ab)","Popolazione interessata intervento (ab.)","Rilevata/ Stimata","Località interessata/e intervento","Iter autorizzativo concluso?","Stadio di progettazione/esecuzione","Entrata in esercizio prevista (anno)","PdI 2014-2017",null,"PdI 2016-2019",null,null,null,"Post 2019",2014,null,2015,null,2016,null,2017,null,2016,null,2017,null,2018,null,2019,null,"TOTALE 2016-2019"]
[null,null,null,null,null,null,null,null,null,null,null,null,null,2016,2017,2016,2017,2018,2019,"Anno? (Specificare)","Finanziato da tariffa","Finanziamento pubblico","Finanziato da tariffa","Finanziamento pubblico","Finanziato da tariffa","Finanziamento pubblico","Finanziato da tariffa","Finanziamento pubblico","Finanziato da tariffa","Finanziamento pubblico","Finanziato da tariffa","Finanziamento pubblico","Finanziato da tariffa","Finanziamento pubblico","Finanziato da tariffa","Finanziamento pubblico","Finanziato da tariffa","Finanziamento pubblico"]
[null,1,"NUOVO POZZO SASSETE","SI","A1","A1.1",14790,2500,"stimata","FIANO ROMANO","SI","Scheda progetto","2016",null,null,null,null,null,0,null,null,null,null,null,0,null,0,null,128691.61500000001,null,0,null,0,null,0,null,{"$f":"SUM(AC10+AE10+AG10+AI10)","v":128691.61500000001},{"$f":"SUM(AD10+AF10+AH10+AJ10)","v":0}]
[null,2,"PERFORAZIONE NUOVO POZZO","NO","A1","A1.1",14790,190,"rilevata","SARACINESCO","NO","Scheda progetto","2017",null,null,null,null,null,0,null,0,null,0,null,0,null,0,null,0,null,180000,null,0,null,0,null,{"$f":"SUM(AC11+AE11+AG11+AI11)","v":180000},{"$f":"SUM(AD11+AF11+AH11+AJ11)","v":0}]
[null,3,"RICERCA IDRICA VELLETRI (per la sotituzione pozzi MAPROL, VICARIO e MARRUCCO)","NO","A1","A1.1",14790,12100,"stimata","VELLETRI","NO","Scheda progetto","2017",null,null,null,null,null,0,null,21189.38,null,7019.62,null,0,null,0,null,0,null,1000000,null,0,null,0,null,{"$f":"SUM(AC12+AE12+AG12+AI12)","v":1000000},{"$f":"SUM(AD12+AF12+AH12+AJ12)","v":0}]
[null,4,"POSA NUOVA CONDOTTA VIA DELLA SELVOTTA, OSPEDALE REGINA APOSTOLORUM","SI","A1","A1.2",288310,20,"stimata","ALBANO LAZIALE","SI","Progetto definitivo","2016",null,null,null,null,null,0,null,null,null,null,null,0,null,0,null,44785,null,0,null,0,null,0,null,44785,0]
[null,5,"POTABILIZZATORE CINQUE BOTTINI","NO","A1","A1.2",288310,1100,"stimata","ALLUMIERE","SI","Progetto definitivo","2016",null,null,null,null,null,0,null,0,null,10132.58,null,0,null,0,null,500000,null,0,null,0,null,0,null,500000,0]
[null,6,"PIANO DI RIENTRO ARICCIA - COLLEGAMENTI RETE IDRICA BASSA","NO","A1","A1.2",288310,110,"stimata","ARICCIA","NO","Scheda progetto","2016",null,null,null,null,null,0,null,null,null,null,null,0,null,0,null,371800,null,0,null,0,null,0,null,371800,0]
[null,7,"CONDOTTA IDRICA DAL POZZO ASSURA AL SERBATOIO MONTE LA GUARDIA (CASTELNUOVO DI PORTO)","SI","A1","A1.2",288310,8000,"stimata","CASTELNUOVO DI PORTO","SI","Scheda progetto","2016",null,null,null,null,null,0,null,17656.96,null,3442.5,null,0,null,0,null,707030.05100000009,null,0,null,0,null,0,null,707030.05100000009,0]
[null,8,"NUOVO SERBATOIO \"PREZIOSA\" E CONDOTTE DI COLLEGAMENTO","SI","A1","A1.2",288310,29630,"rilevata","CIAMPINO","SI","Lavori in corso","2016",null,null,null,null,null,0,null,1067788,null,453534.4,null,1445705.3909999998,null,0,null,3480120.0067652054,null,0,null,0,null,0,null,3480120.0067652054,0]
[null,9,"POTABILIZZATORE SASSETE","NO","A1","A1.2",288310,13900,"stimata","FIANO ROMANO","SI","Progetto definitivo","2016",null,null,null,null,null,0,null,0,null,30571.82,null,0,null,0,null,500000,null,0,null,0,null,0,null,500000,0]
[null,10,"BONIFICA RETI ACQUEDOTTI ARSIAL - TRAGLIATELLA","SI","A1","A1.2",288310,500,"rilevata","FIUMICINO","NO","Scheda progetto","OLTRE 2019",null,null,null,null,null,0,null,0,null,0,null,5200000,null,5200000,null,0,null,0,null,1500000,null,1500000,null,3000000,0]
[null,11,"BONIFICA RETI ACQUEDOTTI ARSIAL - PRATARONI, TRAGLIATA, TESTA DI LEPRE","SI","A1","A1.2",288310,1500,"rilevata","FIUMICINO","NO","Progetto preliminare","OLTRE 2019",null,null,null,null,null,0,null,0,null,165555.4,null,5200000,null,5200000,null,0,null,2000000,null,3000000,null,3000000,null,8000000,0]
[null,12,"ALIMENTAZIONE INTEGRATIVA DEL SISTEMA IDRICO DI FRASCATI DALL'VIII SIFONE","SI","A1","A1.2",288310,22350,"rilevata","FRASCATI","SI","Progetto esecutivo","2017",null,null,null,null,null,0,null,729.79,null,1890.25,null,1950000,null,3237000,null,3077000,null,2500000,null,0,null,0,null,5577000,0]
[null,13,"POTABILIZZATORE E ADEGUAMENTO CENTRALE LAURENTINA ","NO","A1","A1.2",288310,86400,"stimata","INTERCOMUNALE","NO","Scheda progetto","2018",null,null,null,null,null,0,null,0,null,0,null,0,null,0,null,1000000,null,2500000,null,1500000,null,0,null,5000000,0]
[null,14,"POTABILIZZATORE CAMPO POZZI LA DOLCE","NO","A1","A1.2",288310,7000,"stimata","MANZIANA","NO","Scheda progetto","2016",null,null,null,null,null,0,null,0,null,0,null,0,null,0,null,500000,null,0,null,0,null,0,null,500000,0]
[null,15,"POTABILIZZATORE CAVE DELLA DOGANELLA","NO","A1","A1.2",288310,2000,"stimata","ORIOLO ROMANO","SI","Progetto definitivo","2016",null,null,null,null,null,0,null,0,null,15781.57,null,0,null,0,null,500000,null,0,null,0,null,0,null,500000,0]
[null,16,"POTABILIZZATORE FINOCCHIO","NO","A1","A1.2",288310,19100,"stimata","ROMA","NO","Scheda progetto","2016",null,null,null,null,null,0,null,null,null,null,null,0,null,0,null,3000000,null,0,null,0,null,0,null,3000000,0]
[null,17,"SOSTITUZIONI FONTI FF.SS. - DN150 SU VIA AURELIA","SI","A1","A1.2",288310,800,"rilevata","SANTA MARINELLA","NO","Lavori in corso","2016",null,null,null,null,null,0,null,27958.61,null,1398.43,null,0,null,0,null,476963.83800000005,null,0,null,0,null,0,null,476963.83800000005,0]
[null,18,"POTABILIZZATORE FONTANE NUOVE","NO","A1","A1.2",288310,2800,"stimata","SANT'ORESTE","SI","Progetto definitivo","2016",null,null,null,null,null,0,null,0,null,20653.72,null,0,null,0,null,500000,null,0,null,0,null,0,null,500000,0]
[null,19,"INTERVENTI RISANAMENTO ACQUEDOTTI ARSIAL - ACQUEDOTTI MALBORGHETTO, MONTE OLIVIERO E PIANSACCOCCIA","NO","A1","A1.2",288310,2500,"stimata","TERRITORIO SERVITO DA RETE ARSIAL","NO","Progetto definitivo","2017",null,null,null,null,null,0,null,0,12584.28,0,31870.14,0,0,0,0,0,0,0,995085,0,null,0,null,0,995085]
[null,20,"INT. DI RISANAMENTO ARSIAL I STRALCIO I LOTTO ACQ.CASACCIA - SANTA BRIGIDA, TRAGLIATELLA E BRANDOSA","SI","A1","A1.2",288310,3000,"rilevata","TERRITORIO SERVITO DA RETE ARSIAL","SI","Lavori in corso","2016",null,null,null,null,null,0,null,0,1113889,0,2654531,0,2623681,0,0,0,1849134.4170000001,0,0,0,null,0,null,0,1849134.4170000001]
[null,21,"INTERVENTI RISANAMENTO ACQUEDOTTI ARSIAL - BONIFICA RETI ACQUEDOTTI MALBORGHETTO, PIANSACCOCCIA, MONTE OLIVIERO, S. MARIA GALERIA, MALVICINO, OLGIATA, CASACCIA S.BRIGIDA, BRANDOSA NEL COMUNE DI ROMA","SI","A1","A1.2",288310,4000,"stimata","TERRITORIO SERVITO DA RETE ARSIAL","NO","Scheda progetto","OLTRE 2019",null,null,null,null,null,0,null,0,null,0,null,5200000,null,7800000,null,0,null,0,null,1000000,null,2000000,null,3000000,0]
[null,22,"INTERVENTI RISANAMENTO ACQUEDOTTI ARSIAL - BONIFICA RETI ACQUEDOTTO CAMUCCINI","SI","A1","A1.2",288310,200,"rilevata","TERRITORIO SERVITO DA RETE ARSIAL","SI","Lavori in corso","2016",null,null,null,null,null,0,null,0,35510.06,0,352328.5,0,2369250,0,0,0,1979097.1980000001,0,0,0,null,0,null,0,1979097.1980000001]
[null,23,"POTABILIZZATORE TREVIGNANO ROMANO","NO","A1","A1.2",288310,8700,"stimata","TREVIGNANO ROMANO","SI","Progetto definitivo","2016",null,null,null,null,null,0,null,0,null,366701.4,null,0,null,0,null,500000,null,0,null,0,null,0,null,500000,0]
[null,24,"POTABILIZZATORE GORGOGLIONE","NO","A1","A1.2",288310,2300,"stimata","VEJANO","SI","Progetto definitivo","2016",null,null,null,null,null,0,null,0,null,15132.58,null,0,null,0,null,500000,null,0,null,0,null,0,null,500000,0]
[null,25,"POSA CONDOTTA NASC-LE CORTI-MAPROL - III STRALCIO (LE CORTI - NASC)","NO","A1","A1.2",288310,20000,"stimata","VELLETRI","SI","Lavori in corso","2016",null,null,null,null,null,0,null,223681.4,null,141459.9,null,0,null,0,null,301897,null,0,null,0,null,0,null,301897,0]
[null,26,"COLLEGAMENTO NASC, POZZI LE CORTI E MAPROL, RETE IDRICA VELLETRI - IV STRALCIO (DA POZZO MAPROL A RETE DI DISTRIBUZIONE)","NO","A1","A1.2",288310,20000,"stimata","VELLETRI","NO","Progetto esecutivo","2016",null,null,null,null,null,0,null,21189.38,null,7019.62,null,0,null,0,null,236600,null,0,null,0,null,0,null,236600,0]
[null,27,"INTERCONNESSIONE NEMI-VELLETRI, VIA DEI GENZANESI (COMPLETAMENTO) VIA POGGI D'ORO","SI","A1","A1.2",288310,20000,"stimata","VELLETRI","NO","Progetto esecutivo","2016",null,null,null,null,null,0,null,null,null,null,null,0,null,0,null,336537.5,null,0,null,0,null,0,null,336537.5,0]
[null,28,"VIA DEL CIGLIOLO","NO","A1","A1.2",288310,6400,"stimata","VELLETRI","SI","Lavori in corso","2016",null,null,null,null,null,0,null,null,null,null,null,0,null,0,null,157969,null,0,null,0,null,0,null,157969,0]
[null,29,"RILANCIO VIA DEI LAGHI A SOLLEVAMENTO FORMELLONZI","NO","A1","A1.2",288310,5000,"stimata","VELLETRI","SI","Lavori in corso","2016",null,null,null,null,null,0,null,null,null,null,null,0,null,0,null,97500,null,0,null,0,null,0,null,97500,0]
[null,30,"POTENZIAMENTO RILANCIO IDRICO \"TEVOLA\"","NO","A1","A1.2",288310,500,"stimata","VELLETRI","NO","Scheda progetto","2017",null,null,null,null,null,0,null,null,null,null,null,0,null,0,null,0,null,50000,null,0,null,0,null,50000,0]
[null,31,"POTENZIAMENTO RILANCIO IDRICO \"ACQUA LUCIA\"","NO","A1","A1.2",288310,500,"stimata","VELLETRI","NO","Scheda progetto","2017",null,null,null,null,null,0,null,null,null,null,null,0,null,0,null,0,null,50000,null,0,null,0,null,50000,0]
[null,32,"POSA NUOVA CONDOTTA IN PIAZZA MALAGUTI","NO","A4","A4.1",3600000,10,"stimata","ALBANO LAZIALE","NO","Scheda progetto","2016",null,null,null,null,null,0,null,0,null,2614.9299999999998,null,0,null,0,null,17238,null,0,null,0,null,0,null,17238,0]
[null,33,"VIA ROMANA (GENZANO) E VIA APPIA ANTICA (ARICCIA)","NO","A4","A4.1",3600000,70,"stimata","ARICCIA","SI","Progetto definitivo","2016",null,null,null,null,null,0,null,null,null,null,null,0,null,0,null,223925,null,0,null,0,null,0,null,223925,0]
[null,34,"POSA NUOVA CONDOTTA SOLLEVAMENTO IDRICO VALLERICCIA (VIA DEI SANTONI)","NO","A4","A4.1",3600000,10,"stimata","ARICCIA","NO","Scheda progetto","2016",null,null,null,null,null,0,null,null,null,null,null,0,null,0,null,12675,null,0,null,0,null,0,null,12675,0]
[null,35,"RETE IDRICA CONSORZIO VALLE IORO","SI","A4","A4.1",3600000,430,"rilevata","CASTELNUOVO DI PORTO","NO","Scheda progetto","2017",null,null,null,null,null,0,null,0,null,4529.1400000000003,null,1040000,null,0,null,0,null,1040000,null,0,null,0,null,1040000,0]
[null,36,"ADDUTTRICE BELVEDERE - SASSETE","NO","A4","A4.1",3600000,13000,"stimata","FIANO ROMANO","NO","Scheda progetto","2018",null,null,null,null,null,0,null,0,null,0,null,0,null,0,null,0,null,0,null,600000,null,0,null,600000,0]
[null,37,"ALIMENTATRICE AL SERBATOIO DI CAPODIMONTE DALL’ACQUEDOTTO DEL PESCHIERA DESTRO","SI","A4","A4.1",3600000,13000,"stimata","FIANO ROMANO","SI","Lavori in corso","2016",null,null,null,null,null,0,null,622598.40000000002,null,882553.8,null,0,null,0,null,1130028.25,null,0,null,0,null,0,null,1130028.25,0]
[null,38,"COMPLETAMENTO ADDUTTRICE PONTE GALERIA - FIUMICINO","SI","A4","A4.1",3600000,50000,"rilevata","FIUMICINO","NO","Lavori in corso","2018",null,null,null,null,null,0,null,15840.34,null,57072.76,null,1256775,null,0,null,0,null,1491262.5,null,1491262.5,null,0,null,2982525,0]
[null,39,"LAVORI DI REALIZZAZIONE DI UN NUOVO ACQUEDOTTO IN LOCALITÀ SAN PIETRO E SOSTITUZIONE TUBAZIONE IN VIA LUIGI PETROSELLI","NO","A4","A4.1",3600000,150,"stimata","GENAZZANO","NO","Scheda progetto","2017",null,null,null,null,null,0,null,0,null,0,null,0,null,0,null,0,null,448500,null,0,null,0,null,448500,0]
[null,40,"POSA NUOVA CONDOTTA PER COLLEGAMENTO DON STURZO - C.I. LA VILLA","NO","A4","A4.1",3600000,50,"stimata","GENZANO DI ROMA","NO","Scheda progetto","2016",null,null,null,null,null,0,null,0,null,0,null,0,null,0,null,148720,null,0,null,0,null,0,null,148720,0]
[null,41,"REALIZZAZIONE CONDOTTA IDRICA A SERVIZIO DELL’AREA P.I.P. IN LOC. BORGHETTO, VIA VILLA SENNI (S.P. 85/B)","NO","A4","A4.1",3600000,60,"stimata","GROTTAFERRATA","NO","Progetto esecutivo","2016",null,null,null,null,null,0,null,null,null,null,null,0,null,0,null,195000,null,0,null,0,null,0,null,195000,0]
[null,42,"ADDUTTRICE E ALIMENTATRICE IDRICA ALBUCCIONE","SI","A4","A4.1",3600000,14000,"rilevata","GUIDONIA MONTECELIO","SI","Lavori in corso","2017",null,null,null,null,null,0,null,927.96,null,60294.6,null,2600000,null,1309750,null,2000000,null,1138666.4530000002,null,0,null,0,null,3138666.4530000002,0]
[null,43,"ALIMENTATRICE IDRICA LOCALITÀ CARCIBOVE","SI","A4","A4.1",3600000,1900,"rilevata","GUIDONIA MONTECELIO","SI","Progetto esecutivo","2016",null,null,null,null,null,0,null,361.68,null,17315.88,null,497900,null,0,null,1420770,null,0,null,0,null,0,null,1420770,0]
[null,44,"ACQUEDOTTO DALLA SORGENTE DEL PERTUSO ALL’IMPIANTO DI SOLLEVAMENTO DEL CERASO – I LOTTO – TRATTO DALLA GALLERIA DI COLLE DRUNI AL COLLEGAMENTO CON LA CONDOTTA DN 600 ESISTENTE","SI","A4","A4.1",3600000,115200,"rilevata","INTERCOMUNALE","NO","Progetto definitivo","OLTRE 2019",null,null,null,null,null,0,null,96641.01,null,113313.7,null,3900000,null,3900000,null,0,null,1500000,null,3000000,null,3000000,null,7500000,0]
[null,45,"REALIZZAZIONE IMPIANTO BOOSTER SULL’ADDUTTRICE OLGIATA - CIVITAVECCHIA","NO","A4","A4.1",3600000,30000,"rilevata","INTERCOMUNALE","NO","Scheda progetto","2019",null,null,null,null,null,0,null,0,null,0,null,0,null,0,null,0,null,0,null,1000000,null,1000000,null,2000000,0]
[null,46,"ALIMENTAZIONE IDRICA NUOVO OSPEDALE DEI CASTELLI ROMANI ","NO","A4","A4.1",3600000,2500,"stimata","INTERCOMUNALE","NO","Progetto preliminare","2018",null,null,null,null,null,0,null,0,null,129028.8,null,0,null,0,null,0,null,2000000,null,437500,null,0,null,2437500,0]
[null,47,"ADDUZIONE SERBATOIO MACCHIA MICCIA - MARCELLINA","NO","A4","A4.1",3600000,50,"stimata","MARCELLINA","NO","Scheda progetto","2016",null,null,null,null,null,0,null,null,null,null,null,0,null,0,null,160160,null,0,null,0,null,0,null,160160,0]
[null,48,"POSA NUOVA CONDOTTA SU VIA CAVE DI PEPERINO","NO","A4","A4.1",3600000,10,"stimata","MARINO","NO","Scheda progetto","2016",null,null,null,null,null,0,null,null,null,null,null,0,null,0,null,18962,null,0,null,0,null,0,null,18962,0]
[null,49,"COLLEGAMENTO A CAPPUCCINI","NO","A4","A4.1",3600000,40000,"rilevata","MONTEROTONDO","NO","Scheda progetto","2018",null,null,null,null,null,0,null,null,null,null,null,0,null,0,null,0,null,200000,null,254315,null,0,null,454315,0]
[null,50,"ALIMENTATRICE DN 800 DA OSTIA ANTICA AD OSTIA","SI","A4","A4.1",3600000,100000,"stimata","Roma_13-ex18","NO","Progetto esecutivo","OLTRE 2019",null,null,null,null,null,0,null,849.19,null,130.72,null,0,null,780000,null,0,null,0,null,0,null,500000,null,500000,0]
[null,51,"COMPLETAMENTO DEL RADDOPPIO DELL’ADDUTTRICE DN 1600 CASTELL’ARCIONE – SALONE DAL NODO CAPANNACCE AL NODO SALONE","SI","A4","A4.1",3600000,500000,"stimata","Roma_13-ex18","SI","Lavori in corso","2018",null,null,null,null,null,0,null,4469.6400000000003,null,139522.29999999999,null,2600000,null,1780788.5160000005,null,3000000,null,3000000,null,720788.51600000076,null,0,null,6720788.5160000008,0]
[null,52,"ADDUTTRICE OTTAVIA - TRIONFALE - NODO AURELIO (I LOTTO AL NODO TRIONFALE)","NO","A4","A4.1",3600000,150000,"stimata","Roma_13-ex18","NO","Progetto preliminare","OLTRE 2019",null,null,null,null,null,0,null,1895.6,null,0,null,0,null,0,null,0,null,0,null,500000,null,2500000,null,3000000,0]
[null,53,"COMPLETAMENTO DN 500 ALIMENTATRICE PRIMA PORTA","SI","A4","A4.1",3600000,15000,"stimata","Roma_13-ex18","SI","Lavori in corso","2016",null,null,null,null,null,0,null,2802.33,null,499666.8,null,0,null,0,null,849617.19699999993,null,0,null,0,null,0,null,849617.19699999993,0]
[null,54,"ADDUTTRICE DN800 - DAL C.I. AURELIO AL C.I. P.TE GALERIA","SI","A4","A4.1",3600000,130000,"stimata","Roma_13-ex18","NO","Scheda progetto","OLTRE 2019",null,null,null,null,null,0,null,null,null,null,null,2600000,null,2600000,null,0,null,130000,null,2500000,null,2500000,null,5130000,0]
[null,55,"REALIZZAZIONE DN 700 DAL CENTRO IDRICO AURELIO","NO","A4","A4.1",3600000,10000,"stimata","Roma_13-ex18","NO","Progetto preliminare","OLTRE 2019",null,null,null,null,null,0,null,0,null,0,null,0,null,0,null,0,null,0,null,0,null,1000000,null,1000000,0]
[null,56,"ALIMENTATRICE ZONA IDRICA S1B - VIA DELLA STORTA","NO","A4","A4.1",3600000,500,"stimata","Roma_13-ex18","NO","Progetto preliminare","2019",null,null,null,null,null,0,null,2352,null,16315.79,null,0,null,0,null,0,null,0,null,0,null,811688,null,811688,0]
[null,57,"NUOVA ADDUTTRICE BORGO LOTTI-FALCOGNANA NEL COMUNE DI ROMA","NO","A4","A4.1",3600000,1000,"stimata","Roma_13-ex18","NO","Progetto preliminare","2018",null,null,null,null,null,0,null,9596.98,null,80.66,null,0,null,0,null,0,null,0,null,429000,null,0,null,429000,0]
[null,58,"ALIMENTATRICE PONTE DI NONA","NO","A4","A4.1",3600000,15000,"stimata","Roma_13-ex18","NO","Scheda progetto","2018",null,null,null,null,null,0,null,28522.65,null,16713.36,null,0,null,0,null,0,null,1500000,null,645000,null,0,null,2145000,0]
[null,59,"RIPRISTINO FUNZIONALITÀ SOTTOPASSO SIFONI DELL’ACQUA MARCIA","NO","A4","A4.1",3600000,null,null,"Roma_13-ex18","NO","Progetto preliminare","2019",null,null,null,null,null,0,null,0,null,80.66,null,0,null,0,null,0,null,0,null,500000,null,412600,null,912600,0]
[null,60,"POSA CONDOTTA COLLEGAMENTO SERBATOI S.ANNA E PALO DI FERRO - SANT'ORESTE","NO","A4","A4.1",3600000,10,"stimata","SANT'ORESTE","NO","Scheda progetto","2016",null,null,null,null,null,0,null,null,null,null,null,0,null,0,null,25480,null,0,null,0,null,0,null,25480,0]
[null,61,"CONDOTTA DI COLLEGAMENTO SERB. TENNE NUOVE - SORG. FORMA FOCERALE","NO","A4","A4.1",3600000,6000,"stimata","SUBIACO","NO","Scheda progetto","2016",null,null,null,null,null,0,null,0,null,0,null,0,null,0,null,200000,null,0,null,0,null,0,null,200000,0]
[null,62,"PREDISPOSIZIONE DI UN COLLEGAMENTO TRA IL I E II ACQUEDOTTO A VALLE DELL’EDIFICIO DI LICENZA E REALIZZAZIONE DI UNO SCARICO DN 500 SU PONTE TUBO","NO","A4","A4.1",3600000,800000,"stimata","TERRITORIO SERVITO DA ACQ. MARCIO","NO","Scheda progetto","2016",null,null,null,null,null,0,null,0,null,0,null,0,null,0,null,104000,null,0,null,0,null,0,null,104000,0]
[null,63,"REALIZZAZIONE BY-PASS DN 600 I ACQUEDOTTO IN LOCALITÀ FRATTOCCE","NO","A4","A4.1",3600000,800000,"stimata","TERRITORIO SERVITO DA ACQ. MARCIO","NO","Scheda progetto","2016",null,null,null,null,null,0,null,0,null,0,null,0,null,0,null,84500,null,0,null,0,null,0,null,84500,0]
[null,64,"MESSA IN SICUREZZA ACQUEDOTTO PESCHIERA","NO","A4","A4.1",3600000,2000000,"stimata","TERRITORIO SERVITO DA ACQ. PESCHIERA","NO","Scheda progetto","OLTRE 2019",null,null,null,null,null,0,null,127751.6,null,36504.47,null,0,null,0,null,0,null,0,null,0,null,10000000,null,10000000,0]
[null,65,"CONDOTTA DN 600 DA CAVE A COLLE S.ANGELO (VALMONTONE)","SI","A4","A4.1",3600000,100000,"stimata","TERRITORIO SERVITO DA ACQ. SIMBRIVIO","NO","Scheda progetto","OLTRE 2019",null,null,null,null,null,0,null,361.68,null,0,null,0,null,780000,null,0,null,0,null,1000000,null,2000000,null,3000000,0]
[null,66,"CONDOTTA DN 1000/600 DA M.TE CASTELLONE (S.VITO ROMANO) A GENAZZANO","SI","A4","A4.1",3600000,100000,"stimata","TERRITORIO SERVITO DA ACQ. SIMBRIVIO","NO","Progetto preliminare","OLTRE 2019",null,null,null,null,null,0,null,361.68,null,0,null,0,null,780000,null,0,null,0,null,1000000,null,2000000,null,3000000,0]
[null,67,"CONDOTTA LABICO-VELLETRI (IV LOTTO I COLLI-COLLI ILLIRIO) E COLL. POZZI DOGANELLA (4C)","SI","A4","A4.1",3600000,100000,"stimata","TERRITORIO SERVITO DA ACQ. SIMBRIVIO","NO","Scheda progetto","OLTRE 2019",null,null,null,null,null,0,null,0,null,0,null,0,null,390000,null,0,null,0,null,0,null,1000000,null,{"$f":"SUM(AC76+AE76+AG76+AI76)","v":1000000},{"$f":"SUM(AD76+AF76+AH76+AJ76)","v":0}]
[null,68,"INTERVENTI DI RISANAMENTO DEGLI ACQUEDOTTI ARSIAL (I Stralcio funzionale – II lotto)\nACQUEDOTTO MONTE OLIVIERO - CONDOTTA DN 100 DI COMPLETAMENTO","SI","A4","A4.1",3600000,1000,"stimata","TERRITORIO SERVITO DA RETE ARSIAL","NO","Progetto definitivo","2017",null,null,null,null,null,0,null,0,476.09,0,3549.77,0,520000,0,0,0,0,0,780585,0,null,0,null,0,780585]
[null,69,"CONDOTTA PER L'ALIMENTAZIONE IDRICA DI VILLAGGIO ADRIANO - TIVOLI","SI","A4","A4.1",3600000,12300,"stimata","TIVOLI","SI","Lavori in corso","2016",null,null,null,null,null,0,null,350316.6,null,1906448,null,0,null,0,null,159279.73099999974,null,0,null,0,null,0,null,159279.73099999974,0]
[null,70,"POSA NUOVA CONDOTTA E SPOSTAMENTO PRESE SU VIA ARIANA - VIA DEI CASTAGNOLI - VELLETRI","NO","A4","A4.1",3600000,30,"stimata","VELLETRI","NO","Scheda progetto","2016",null,null,null,null,null,0,null,null,null,null,null,0,null,0,null,87880,null,0,null,0,null,0,null,87880,0]
[null,71,"NUOVA PREMENTE SFORZA CESARINI","NO","A4","A4.2",3600000,5000,"stimata","CASTEL GANDOLFO","NO","Scheda progetto","2018",null,null,null,null,null,0,null,0,null,0,null,0,null,0,null,0,null,0,null,1000000,null,0,null,1000000,0]
[null,72,"BONIFICA CONDOTTA DI DERIVAZIONE DALL’ACQUEDOTTO PESCHIERA (FINESTRA XXIX) VERSO IL COMUNE DI RIANO ","NO","A4","A4.2",3600000,9500,"rilevata","CASTELNUOVO DI PORTO","NO","Progetto definitvo","2018",null,null,null,null,null,0,null,null,null,null,null,0,null,0,null,0,null,300000,null,543375,null,0,null,843375,0]
[null,73,"RISTRUTTURAZIONE E MESSA IN SICUREZZA CENTRO IDRICO \"BUNKER\" FRASCATI","NO","A4","A4.2",3600000,13900,"rilevata","FRASCATI","NO","Progetto definitivo","2018",null,null,null,null,null,0,null,0,null,0,null,0,null,0,null,0,null,1973750,null,1000000,null,0,null,2973750,0]
[null,74,"RISTRUTTURAZIONE E MESSA IN SICUREZZA CENTRO IDRICO \"ROMITO\" MONTE COMPATRI","NO","A4","A4.2",3600000,10000,"stimata","MONTECOMPATRI","NO","Progetto preliminare","OLTRE 2019",null,null,null,null,null,0,null,0,null,0,null,0,null,0,null,0,null,0,null,0,null,500000,null,500000,0]
[null,75,"MANUTENZIONE CENTRI IDRICI - FUORI ROMA","NO","A4","A4.2",3600000,1000000,"stimata","OLTRE ROMA","NO","Scheda progetto","2019",null,null,null,null,null,0,null,null,null,null,null,0,null,0,null,2500000,null,2500000,null,2500000,null,2500000,null,10000000,0]
[null,76,"RISTRUTTURAZIONE E MESSA IN SICUREZZA CENTRO IDRICO \"CALCARA\"ROCCA PRIORA","NO","A4","A4.2",3600000,10000,"stimata","ROCCA PRIORA","NO","Progetto preliminare","2018",null,null,null,null,null,0,null,0,null,0,null,0,null,0,null,0,null,750000,null,634500,null,0,null,1384500,0]
[null,77,"INTERVENTI DI RISANAMENTO E RISTRUTTURAZIONE CENTRO IDRICO MONTE MARIO","NO","A4","A4.2",3600000,1000000,"stimata","ROMA","NO","Scheda progetto","2018",null,null,null,null,null,0,null,null,null,null,null,0,null,0,null,0,null,1500000,null,1500000,null,0,null,3000000,0]
[null,78,"INTERVENTI DI RISANAMENTO E RISTRUTTURAZIONE CENTRO IDRICO CECCHINA","NO","A4","A4.2",3600000,200000,"stimata","ROMA","NO","Scheda progetto","2017",null,null,null,null,null,0,null,null,null,null,null,0,null,0,null,0,null,1000000,null,0,null,0,null,1000000,0]
[null,79,"POTENZIAMENTO IMPIANTO TRATTAMENTO GROTTAROSSA","NO","A4","A4.2",3600000,100000,"stimata","ROMA","NO","Scheda progetto","2017",null,null,null,null,null,0,null,0,null,null,null,0,null,0,null,0,null,1000000,null,0,null,0,null,1000000,0]
[null,80,"MANUTENZIONE CENTRI IDRICI - ROMA","NO","A4","A4.2",3600000,2600000,"stimata","ROMA","NO","Scheda progetto","2019",null,null,null,null,null,0,null,null,null,null,null,0,null,0,null,2000000,null,2000000,null,2000000,null,2000000,null,8000000,0]
[null,81,"BONIFICA PROGRAMMATA SISTEMA ACQUEDOTTO MARCIO","NO","A4","A4.2",3600000,800000,"stimata","TERRITORIO SERVITO DA ACQ. MARCIO","NO","Scheda progetto","OLTRE 2019",null,null,null,null,null,0,null,0,null,0,null,0,null,0,null,0,null,0,null,0,null,5000000,null,5000000,0]
[null,82,"INTERVENTI DI RISANAMENTO DELLA GALLERIA COLLETTRICE DELLE SORGENTI DEL PESCHIERA","SI","A4","A4.2",3600000,2000000,"stimata","TERRITORIO SERVITO DA ACQ. PESCHIERA","SI","Scheda progetto","2017",null,null,null,null,null,0,null,12446.09,null,2701.64,null,2600000,null,775287.5,null,2692666.1280000005,null,2500000,null,0,null,0,null,5192666.1280000005,0]
[null,83,"MANUTENZIONE CENTRALE IDRICA DELLE SORGENTI DI PESCHIERA","NO","A4","A4.2",3600000,2000000,"stimata","TERRITORIO SERVITO DA ACQ. PESCHIERA","SI","Progetto definitivo","2016",null,null,null,null,null,0,null,null,null,null,null,0,null,0,null,400000,null,0,null,0,null,0,null,400000,0]
[null,84,"BONIFICA CONDOTTA IDRICA TRATTA 49 SIMBRIVIO","NO","A4","A4.2",3600000,100000,"stimata","TERRITORIO SERVITO DA ACQ. SIMBRIVIO","NO","Scheda progetto","2019",null,null,null,null,null,0,null,null,null,null,null,0,null,0,null,0,null,0,null,0,null,633750,null,633750,0]
[null,85,"BONIFICA CONDOTTE: VECCHIO ACQUEDOTTO SIMBRIVIO CASTELLI - TRATTA 29; NUOVO ACQUEDOTTO SIMBRIVIO CASTELLI - TRATTE: 199 E 201","NO","A4","A4.2",3600000,100000,"stimata","TERRITORIO SERVITO DA ACQ. SIMBRIVIO","NO","Scheda progetto","2017",null,null,null,null,null,0,null,null,null,null,null,0,null,0,null,500000,null,1190000,null,0,null,0,null,1690000,0]
[null,86,"BONIFICA E POTENZIAMENTO ALIMENTATRICE IDRICA LOCALITA' RADICATA","NO","A4","A4.2",3600000,100,"stimata","TOLFA","NO","Scheda progetto","2016",null,null,null,null,null,0,null,null,null,null,null,0,null,0,null,250000,null,0,null,0,null,0,null,250000,0]
[null,87,"BONIFICA RETE IDRICA COMUNE DI AFFILE","NO","B1","B1.1",3600000,60,"stimata","AFFILE","NO","Scheda progetto","2019",null,null,null,null,null,0.08,null,null,null,null,null,0,null,0,null,0,null,0,null,0,null,155975.82,null,155975.82,0]
[null,88,"BONIFICA RETE IDRICA COMUNE DI ALBANO LAZIALE","NO","B1","B1.1",3600000,180,"stimata","ALBANO LAZIALE","NO","Scheda progetto","2019",null,null,null,null,null,0.08,null,null,null,null,null,0,null,0,null,0,null,0,null,0,null,500000,null,500000,0]
[null,89,"BONIFICA RETE IDRICA COMUNE DI ARCINAZZO ROMANO","NO","B1","B1.1",3600000,80,"stimata","ARCINAZZO ROMANO","NO","Scheda progetto","2019",null,null,null,null,null,0.08,null,null,null,null,null,0,null,0,null,0,null,0,null,0,null,200000,null,200000,0]
[null,90,"BONIFICA RETE IDRICA COMUNE DI ARICCIA","NO","B1","B1.1",3600000,290,"stimata","ARICCIA","NO","Scheda progetto","2019",null,null,null,null,null,0.08,null,null,null,null,null,0,null,0,null,0,null,0,null,500000,null,300000,null,800000,0]
[null,91,"ALIMENTAZIONE LOCALITÀ TAGLIENTE E CASA COLONNELLA DAL SERBATOIO \"LE MACERE\"","NO","B1","B1.1",3600000,600,"stimata","ARTENA","NO","Scheda progetto","2018",null,null,null,null,null,0,null,0,null,1778.49,null,0,null,0,null,0,null,1000000,null,462500,null,0,null,1462500,0]
[null,92,"BONIFICA RETE IDRICA COMUNE DI BELLEGRA","NO","B1","B1.1",3600000,90,"stimata","BELLEGRA","NO","Scheda progetto","2019",null,null,null,null,null,0.08,null,null,null,null,null,0,null,0,null,0,null,0,null,0,null,250000,null,250000,0]
[null,93,"BONIFICA RETE IDRICA COMUNE DI CAPRANICA PRENESTINA","NO","B1","B1.1",3600000,40,"stimata","CAPRANICA PRENESTINA","NO","Scheda progetto","2018",null,null,null,null,null,0.08,null,null,null,null,null,0,null,0,null,0,null,0,null,90000,null,0,null,90000,0]
[null,94,"BONIFICA RETE IDRICA COMUNE DI CARPINETO ROMANO","NO","B1","B1.1",3600000,110,"stimata","CARPINETO ROMANO","NO","Scheda progetto","2019",null,null,null,null,null,0.08,null,null,null,null,null,0,null,0,null,0,null,0,null,0,null,300000,null,300000,0]
[null,95,"BONIFICA RETE IDRICA COMUNE DI CASAPE","NO","B1","B1.1",3600000,60,"stimata","CASAPE","NO","Scheda progetto","2016",null,null,null,null,null,0.08,null,null,null,null,null,0,null,0,null,150000,null,0,null,0,null,0,null,150000,0]
[null,96,"BONIFICA RETE IDRICA COMUNE DI CASTEL GANDOLFO","NO","B1","B1.1",3600000,60,"stimata","CASTEL GANDOLFO","NO","Scheda progetto","2019",null,null,null,null,null,0.08,null,null,null,null,null,0,null,0,null,0,null,0,null,0,null,150000,null,150000,0]
[null,97,"BONIFICA RETE IDRICA COMUNE DI CASTEL MADAMA","NO","B1","B1.1",3600000,100,"stimata","CASTEL MADAMA","NO","Scheda progetto","2016",null,null,null,null,null,0.08,null,null,null,null,null,0,null,0,null,270000,null,0,null,0,null,0,null,270000,0]
[null,98,"BONIFICA RETE IDRICA COMUNE DI CASTEL SAN PIETRO ROMANO","NO","B1","B1.1",3600000,20,"stimata","CASTEL SAN PIETRO ROMANO","NO","Scheda progetto","2017",null,null,null,null,null,0.08,null,null,null,null,null,0,null,0,null,0,null,50000,null,0,null,0,null,50000,0]
[null,99,"BONIFICA RETE IDRICA COMUNE DI CASTELNUOVO DI PORTO","NO","B1","B1.1",3600000,110,"stimata","CASTELNUOVO DI PORTO","NO","Scheda progetto","2019",null,null,null,null,null,0.08,null,null,null,null,null,0,null,0,null,0,null,0,null,0,null,290000,null,290000,0]
[null,100,"BONIFICA RETE IDRICA COMUNE DI CAVE","NO","B1","B1.1",3600000,60,"stimata","CAVE","NO","Scheda progetto","2016",null,null,null,null,null,0.08,null,null,null,null,null,0,null,0,null,150000,null,0,null,0,null,0,null,150000,0]
[null,101,"BONIFICA RETE IDRICA COMUNE DI CERVARA DI ROMA","NO","B1","B1.1",3600000,40,"stimata","CERVARA DI ROMA","NO","Scheda progetto","2018",null,null,null,null,null,0.08,null,null,null,null,null,0,null,0,null,0,null,0,null,100000,null,0,null,100000,0]
[null,102,"BONIFICA RETE IDRICA COMUNE DI CICILIANO","NO","B1","B1.1",3600000,80,"stimata","CICILIANO","NO","Scheda progetto","2019",null,null,null,null,null,0.08,null,null,null,null,null,0,null,0,null,0,null,0,null,0,null,200000,null,200000,0]
[null,103,"BONIFICA RETE IDRICA COMUNE DI COLONNA","NO","B1","B1.1",3600000,50,"stimata","COLONNA","NO","Scheda progetto","2019",null,null,null,null,null,0.08,null,null,null,null,null,0,null,0,null,0,null,0,null,0,null,130000,null,130000,0]
[null,104,"BONIFICA RETE IDRICA COMUNE DI FIANO ROMANO","NO","B1","B1.1",3600000,170,"stimata","FIANO ROMANO","NO","Scheda progetto","2018",null,null,null,null,null,0.08,null,null,null,null,null,0,null,0,null,0,null,0,null,460000,null,0,null,460000,0]
[null,105,"BONIFICA RETE IDRICA COMUNE DI FONTE NUOVA","NO","B1","B1.1",3600000,360,"stimata","FONTENUOVA ","NO","Scheda progetto","2019",null,null,null,null,null,0.08,null,null,null,null,null,0,null,0,null,0,null,0,null,500000,null,500000,null,1000000,0]
[null,106,"BONIFICA RETE IDRICA COMUNE DI FORMELLO","NO","B1","B1.1",3600000,110,"stimata","FORMELLO","NO","Scheda progetto","2019",null,null,null,null,null,0.08,null,null,null,null,null,0,null,0,null,0,null,0,null,0,null,300000,null,300000,0]
[null,107,"BONIFICA RETE IDRICA COMUNE DI FRASCATI","NO","B1","B1.1",3600000,180,"stimata","FRASCATI","NO","Scheda progetto","2019",null,null,null,null,null,0.08,null,null,null,null,null,0,null,0,null,0,null,0,null,0,null,500000,null,500000,0]
[null,108,"BONIFICA RETE IDRICA COMUNE DI GALLICANO NEL LAZIO","NO","B1","B1.1",3600000,70,"stimata","GALLICANO NEL LAZIO","NO","Scheda progetto","2018",null,null,null,null,null,0.08,null,null,null,null,null,0,null,0,null,0,null,0,null,180000,null,0,null,180000,0]
[null,109,"BONIFICA RETE IDRICA COMUNE DI GENAZZANO","NO","B1","B1.1",3600000,200,"stimata","GENAZZANO","NO","Scheda progetto","2017",null,null,null,null,null,0.08,null,null,null,null,null,0,null,0,null,350000,null,210000,null,0,null,0,null,560000,0]
[null,110,"BONIFICA RETE IDRICA COMUNE DI GENZANO DI ROMA","NO","B1","B1.1",3600000,220,"stimata","GENZANO DI ROMA","NO","Scheda progetto","2019",null,null,null,null,null,0.08,null,null,null,null,null,0,null,0,null,0,null,0,null,300000,null,300000,null,600000,0]
[null,111,"BONIFICA RETE IDRICA COMUNE DI GROTTAFERRATA","NO","B1","B1.1",3600000,110,"stimata","GROTTAFERRATA","NO","Scheda progetto","2016",null,null,null,null,null,0.08,null,null,null,null,null,0,null,0,null,300000,null,0,null,0,null,0,null,300000,0]
[null,112,"BONIFICA RETE IDRICA NEL COMUNE DI GUIDONIA MONTECELIO - LOC. ''PICHINI''","SI","B1","B1.1",3600000,2200,"stimata","GUIDONIA MONTECELIO","SI","Lavori in corso","2016",null,null,null,null,null,0,null,30875.7,null,587058.5,null,317850,null,0,null,606874.74900000007,null,0,null,0,null,0,null,606874.74900000007,0]
[null,113,"BONIFICA RETE IDRICA NEL COMUNE DI GUIDONIA MONTECELIO - LOC.''VILLANOVA''","NO","B1","B1.1",3600000,15000,"stimata","GUIDONIA MONTECELIO","NO","Scheda progetto","OLTRE 2019",null,null,null,null,null,0,null,30875.7,null,587058.5,null,0,null,0,null,0,null,0,null,0,null,500000,null,500000,0]
[null,114,"BONIFICA RETE IDRICA COMUNE DI GUIDONIA MONTECELIO","NO","B1","B1.1",3600000,200,"stimata","GUIDONIA MONTECELIO","NO","Scheda progetto","2019",null,null,null,null,null,0.08,null,30875.7,null,587058.5,null,0,null,0,null,0,null,0,null,250000,null,300000,null,550000,0]
[null,115,"BONIFICHE ALLACCI IDRICI ","NO","B1","B1.1",3600000,4280,"stimata","INTERCOMUNALE","N.A.",null,"2019",null,null,null,null,null,0.08,null,null,null,null,null,0,null,0,null,3000000,null,3000000,null,3000000,null,3000000,null,12000000,0]
[null,116,"DEFINIZIONE DISTRETTI IDRICI E RICERCA PERDITE","NO","B1","B1.1",3600000,3600000,"stimata","INTERCOMUNALE","N.A.","Lavori in corso","2019",null,null,null,null,null,0.08,null,null,null,null,null,0,null,0,null,1000000,null,1000000,null,1000000,null,1000000,null,4000000,0]
[null,117,"BONIFICA RETE IDRICA COMUNE DI LANUVIO","NO","B1","B1.1",3600000,150,"stimata","LANUVIO","NO","Scheda progetto","2019",null,null,null,null,null,0.08,null,null,null,null,null,0,null,0,null,0,null,0,null,200000,null,200000,null,400000,0]
[null,118,"BONIFICA RETE IDRICA COMUNE DI LARIANO","NO","B1","B1.1",3600000,210,"stimata","LARIANO","NO","Scheda progetto","2019",null,null,null,null,null,0.08,null,null,null,null,null,0,null,0,null,0,null,0,null,350000,null,230000,null,580000,0]
[null,119,"BONIFICA RETE IDRICA COMUNE DI MARCELLINA","NO","B1","B1.1",3600000,290,"stimata","MARCELLINA","NO","Scheda progetto","2018",null,null,null,null,null,0.08,null,null,null,null,null,0,null,0,null,0,null,400000,null,400000,null,0,null,800000,0]
[null,120,"BONIFICA RETE IDRICA COMUNE DI MARINO","NO","B1","B1.1",3600000,220,"stimata","MARINO","NO","Scheda progetto","2018",null,null,null,null,null,0.08,null,null,null,null,null,0,null,0,null,0,null,300000,null,300000,null,0,null,600000,0]
[null,121,"BONIFICA RETE IDRICA NEL COMUNE DI MENTANA","NO","B1","B1.1",3600000,1100,"stimata","MENTANA","NO","Lavori in corso","2017",null,null,null,null,null,0,null,24519.45,null,14352.12,null,0,null,0,null,780000,null,780000,null,0,null,0,null,1560000,0]
[null,122,"BONIFICA RETE IDRICA COMUNE DI MENTANA","NO","B1","B1.1",3600000,290,"stimata","MENTANA","NO","Scheda progetto","2019",null,null,null,null,null,0.08,null,null,null,null,null,0,null,0,null,0,null,0,null,300000,null,500000,null,{"$f":"SUM(AC131+AE131+AG131+AI131)","v":800000},{"$f":"SUM(AD131+AF131+AH131+AJ131)","v":0}]
[null,123,"BONIFICA RETE IDRICA COMUNE DI MONTEPORZIO CATONE","NO","B1","B1.1",3600000,80,"stimata","MONTE PORZIO CATONE","NO","Scheda progetto","2019",null,null,null,null,null,0.08,null,null,null,null,null,0,null,0,null,0,null,0,null,0,null,200000,null,200000,0]
[null,124,"BONIFICA RETE IDRICA COMUNE DI MONTECOMPATRI","NO","B1","B1.1",3600000,130,"stimata","MONTECOMPATRI","NO","Scheda progetto","2019",null,null,null,null,null,0.08,null,null,null,null,null,0,null,0,null,0,null,0,null,0,null,340000,null,340000,0]
[null,125,"BONIFICA RETE IDRICA COMUNE DI MONTEROTONDO","NO","B1","B1.1",3600000,290,"stimata","MONTEROTONDO","NO","Scheda progetto","2019",null,null,null,null,null,0.08,null,null,null,null,null,0,null,0,null,0,null,0,null,0,null,800000,null,800000,0]
[null,126,"BONIFICA RETE IDRICA COMUNE DI NEMI","NO","B1","B1.1",3600000,90,"stimata","NEMI","NO","Scheda progetto","2019",null,null,null,null,null,0.08,null,null,null,null,null,0,null,0,null,0,null,0,null,0,null,250000,null,250000,0]
[null,127,"BONIFICA RETE IDRICA COMUNE DI OLEVANO ROMANO","NO","B1","B1.1",3600000,110,"stimata","OLEVANO ROMANO","NO","Scheda progetto","2018",null,null,null,null,null,0.08,null,null,null,null,null,0,null,0,null,0,null,0,null,300000,null,0,null,300000,0]
[null,128,"BONIFICA RETE IDRICA COMUNE DI ORIOLO ROMANO","NO","B1","B1.1",3600000,60,"stimata","ORIOLO ROMANO","NO","Scheda progetto","2018",null,null,null,null,null,0.08,null,null,null,null,null,0,null,0,null,0,null,0,null,150000,null,0,null,150000,0]
[null,129,"BONIFICA RETE IDRICA COMUNE DI PALESTRINA","NO","B1","B1.1",3600000,330,"stimata","PALESTRINA ","NO","Scheda progetto","2017",null,null,null,null,null,0.08,null,null,null,null,null,0,null,0,null,450000,null,450000,null,0,null,0,null,900000,0]
[null,130,"BONIFICA RETE IDRICA COMUNE DI PISONIANO","NO","B1","B1.1",3600000,40,"stimata","PISONIANO","NO","Scheda progetto","2019",null,null,null,null,null,0.08,null,null,null,null,null,0,null,0,null,0,null,0,null,0,null,100000,null,100000,0]
[null,131,"BONIFICA RETE IDRICA COMUNE DI POLI","NO","B1","B1.1",3600000,90,"stimata","POLI","NO","Scheda progetto","2019",null,null,null,null,null,0.08,null,null,null,null,null,0,null,0,null,0,null,0,null,0,null,250000,null,250000,0]
[null,132,"BONIFICA RETE IDRICA COMUNE DI ROCCA DI CAVE","NO","B1","B1.1",3600000,20,"stimata","ROCCA DI CAVE","NO","Scheda progetto","2019",null,null,null,null,null,0.08,null,null,null,null,null,0,null,0,null,0,null,0,null,0,null,50000,null,50000,0]
[null,133,"BONIFICA RETE IDRICA COMUNE DI ROCCA DI PAPA","NO","B1","B1.1",3600000,180,"stimata","ROCCA DI PAPA","NO","Scheda progetto","2018",null,null,null,null,null,0.08,null,null,null,null,null,0,null,0,null,0,null,0,null,500000,null,0,null,500000,0]
[null,134,"BONIFICA RETE IDRICA COMUNE DI ROCCA PRIORA","NO","B1","B1.1",3600000,180,"stimata","ROCCA PRIORA","NO","Scheda progetto","2019",null,null,null,null,null,0.08,null,null,null,null,null,0,null,0,null,0,null,0,null,0,null,500000,null,500000,0]
[null,135,"BONIFICA RETE IDRICA COMUNE DI ROCCA SANTO STEFANO","NO","B1","B1.1",3600000,60,"stimata","ROCCA SANTO STEFANO","NO","Scheda progetto","2019",null,null,null,null,null,0.08,null,null,null,null,null,0,null,0,null,0,null,0,null,0,null,150000,null,150000,0]
[null,136,"BONIFICA RETE IDRICA COMUNE DI ROIATE","NO","B1","B1.1",3600000,30,"stimata","ROIATE","NO","Scheda progetto","2016",null,null,null,null,null,0.08,null,null,null,null,null,0,null,0,null,70000,null,0,null,0,null,0,null,70000,0]
[null,137,"BONIFICA RETE IDRICA COMUNE DI ROMA","NO","B1","B1.1",3600000,2320,"stimata","ROMA","lavori in corso",null,"2019",null,null,null,null,null,0.08,null,null,null,null,null,0,null,0,null,1500000,null,1500000,null,1500000,null,2000000,null,6500000,0]
[null,138,"RISTRUTTURAZIONE ACQUEDOTTO RURALE “I PIANI DI OSTIA” – ANELLO A – CBTAR ","NO","B1","B1.1",3600000,500,"stimata","Roma_13-ex18","NO","Progetto preliminare","OLTRE 2019",null,null,null,null,null,0,null,0,null,0,null,0,null,0,null,0,null,0,null,0,null,1500000,null,1500000,0]
[null,139,"POTENZIAMENTO CONDOTTE IDRICHE NEL COMUNE DI SACROFANO","SI","B1","B1.1",3600000,300,"rilevata","SACROFANO","NO","Scheda progetto","2018",null,null,null,null,null,0,null,12432.81,null,36069.370000000003,null,0,null,650000,null,0,null,539955,null,809932.5,null,0,null,1349887.5,0]
[null,140,"BONIFICA RETE IDRICA COMUNE DI SACROFANO","NO","B1","B1.1",3600000,90,"stimata","SACROFANO","NO","Scheda progetto","2016",null,null,null,null,null,0.08,null,null,null,null,null,0,null,0,null,250000,null,0,null,0,null,0,null,250000,0]
[null,141,"BONIFICA RETE IDRICA COMUNE DI SAMBUCI","NO","B1","B1.1",3600000,40,"stimata","SAMBUCI","NO","Scheda progetto","2019",null,null,null,null,null,0.08,null,null,null,null,null,0,null,0,null,0,null,0,null,0,null,100000,null,100000,0]
[null,142,"BONIFICA RETE IDRICA COMUNE DI SAN CESAREO","NO","B1","B1.1",3600000,110,"stimata","SAN CESAREO","NO","Scheda progetto","2019",null,null,null,null,null,0.08,null,null,null,null,null,0,null,0,null,0,null,0,null,150000,null,150000,null,300000,0]
[null,143,"BONIFICA TRATTO IDRICO DI CONDOTTA IN VIA FAUSTINIANA","NO","B1","B1.1",3600000,150,"stimata","SAN GREGORIO DA SASSOLA","NO","Scheda progetto","2016",null,null,null,null,null,0,null,0,null,0,null,0,null,0,null,300000,null,0,null,0,null,0,null,300000,0]
[null,144,"BONIFICA RETE IDRICA COMUNE DI SAN POLO DEI CAVALIERI","NO","B1","B1.1",3600000,80,"stimata","SAN POLO DEI CAVALIERI","NO","Scheda progetto","2018",null,null,null,null,null,0.08,null,null,null,null,null,0,null,0,null,0,null,0,null,220000,null,0,null,220000,0]
[null,145,"BONIFICA RETE IDRICA COMUNE DI SAN VITO ROMANO","NO","B1","B1.1",3600000,180,"stimata","SAN VITO ROMANO","NO","Scheda progetto","2019",null,null,null,null,null,0.08,null,null,null,null,null,0,null,0,null,0,null,0,null,0,null,500000,null,500000,0]
[null,146,"BONIFICA RETE IDRICA COMUNE DI SANTA MARINELLA","NO","B1","B1.1",3600000,180,"stimata","SANTA MARINELLA","NO","Scheda progetto","2018",null,null,null,null,null,0.08,null,null,null,null,null,0,null,0,null,0,null,0,null,500000,null,0,null,500000,0]
[null,147,"BONIFICA RETE IDRICA NEL COMUNE DI SANT'ORESTE","NO","B1","B1.1",3600000,250,"stimata","SANT'ORESTE","NO","Scheda progetto","2017",null,null,null,null,null,0,null,0,null,567.46,null,0,null,0,null,450000,null,450000,null,0,null,0,null,900000,0]
[null,148,"BONIFICA RETE IDRICA COMUNE DI SANT'ORESTE","NO","B1","B1.1",3600000,360,"stimata","SANT'ORESTE","NO","Scheda progetto","2019",null,null,null,null,null,0.08,null,null,null,null,null,0,null,0,null,0,null,0,null,500000,null,500000,null,1000000,0]
[null,149,"BONIFICA RETE IDRICA COMUNE DI SARACINESCO","NO","B1","B1.1",3600000,20,"stimata","SARACINESCO","NO","Scheda progetto","2019",null,null,null,null,null,0.08,null,null,null,null,null,0,null,0,null,0,null,0,null,0,null,50000,null,50000,0]
[null,150,"BONIFICA RETE IDRICA COMUNE DI SEGNI","NO","B1","B1.1",3600000,80,"stimata","SEGNI","NO","Scheda progetto","2016",null,null,null,null,null,0.08,null,null,null,null,null,0,null,0,null,220000,null,0,null,0,null,0,null,220000,0]
[null,151,"BONIFICA RETE IDRICA ''TIVOLI TERME''","SI","B1","B1.1",3600000,9500,"stimata","TIVOLI","SI","Lavori in corso","2019",null,null,null,null,null,0,null,572.54,null,0,null,1950000,null,205400,null,0,null,500000,null,1500000,null,415400,null,2415400,0]
[null,152,"BONIFICA RETE IDRICA VILLA ADRIANA","SI","B1","B1.1",3600000,3000,"stimata","TIVOLI","NO","Lavori in corso","2019",null,null,null,null,null,0,null,361.68,null,26627.599999999999,null,650000,null,1560000,null,0,null,1000000,null,1500000,null,762496,null,3262496,0]
[null,153,"BONIFICA RETE IDRICA COMUNE DI TORRITA TIBERINA","NO","B1","B1.1",3600000,50,"stimata","TORRITA TIBERINA","NO","Scheda progetto","2019",null,null,null,null,null,0.08,null,null,null,null,null,0,null,0,null,0,null,0,null,0,null,130000,null,130000,0]
[null,154,"BONIFICA RETE IDRICA COMUNE DI TREVIGNANO ROMANO","NO","B1","B1.1",3600000,90,"stimata","TREVIGNANO ROMANO","NO","Scheda progetto","2019",null,null,null,null,null,0.08,null,null,null,null,null,0,null,0,null,0,null,0,null,0,null,250000,null,250000,0]
[null,155,"BONIFICA RETE IDRICA COMUNE DI VEJANO","NO","B1","B1.1",3600000,30,"stimata","VEJANO","NO","Scheda progetto","2019",null,null,null,null,null,0.08,null,null,null,null,null,0,null,0,null,0,null,0,null,0,null,70000,null,70000,0]
[null,156,"BONIFICA RETE IDRICA COMUNE DI VELLETRI","NO","B1","B1.1",3600000,560,"stimata","VELLETRI","NO","Scheda progetto","2017",null,null,null,null,null,0.08,null,null,null,null,null,0,null,0,null,780000,null,780000,null,0,null,0,null,1560000,0]
[null,157,"BONIFICA RETE IDRICA COMUNE DI VICOVARO","NO","B1","B1.1",3600000,40,"stimata","VICOVARO","NO","Scheda progetto","2016",null,null,null,null,null,0.08,null,null,null,null,null,0,null,0,null,100000,null,0,null,0,null,0,null,100000,0]
[null,158,"BONIFICA RETE IDRICA COMUNE DI ZAGAROLO","NO","B1","B1.1",3600000,180,"stimata","ZAGAROLO","NO","Scheda progetto","2018",null,null,null,null,null,0.08,null,null,null,null,null,0,null,0,null,0,null,0,null,500000,null,0,null,500000,0]
[null,159,"ESTENSIONE RETE IDRICA COMUNE DI ALLUMIERE","NO","B7","B7.1",30000,20,"stimata","ALLUMIERE","NO","Scheda progetto","2017",null,null,null,null,null,0.35,null,null,null,null,null,0,null,0,null,30000,null,40000,null,0,null,0,null,70000,0]
[null,160,"ESTENSIONE RETE IDRICA COMUNE DI ARCINAZZO","NO","B7","B7.1",30000,30,"stimata","ARCINAZZO ROMANO","NO","Scheda progetto","2016",null,null,null,null,null,0.35,null,null,null,null,null,0,null,0,null,80000,null,0,null,0,null,0,null,80000,0]
[null,161,"ESTENSIONE RETE IDRICA COMUNE DI ARICCIA","NO","B7","B7.1",30000,20,"stimata","ARICCIA","NO","Scheda progetto","2017",null,null,null,null,null,0.35,null,null,null,null,null,0,null,0,null,30000,null,40000,null,0,null,0,null,70000,0]
[null,162,"ESTENSIONE RETE IDRICA COMUNE DI ARTENA","NO","B7","B7.1",30000,70,"stimata","ARTENA","NO","Scheda progetto","2017",null,null,null,null,null,0.35,null,null,null,null,null,0,null,0,null,110000,null,110000,null,0,null,0,null,220000,0]
[null,163,"ESTENSIONE RETE IDRICA COMUNE DI CANTERANO","NO","B7","B7.1",30000,30,"stimata","CANTERANO","NO","Scheda progetto","2016",null,null,null,null,null,0.35,null,null,null,null,null,0,null,0,null,100000,null,0,null,0,null,0,null,100000,0]
[null,164,"ESTENSIONE RETE IDRICA COMUNE DI CAPRANICA PRENESTINA","NO","B7","B7.1",30000,70,"stimata","CAPRANICA PRENESTINA","NO","Scheda progetto","2019",null,null,null,null,null,0.35,null,null,null,null,null,0,null,0,null,0,null,0,null,0,null,250000,null,250000,0]
[null,165,"ESTENSIONE RETE IDRICA COMUNE DI CASTELNUOVO DI PORTO","NO","B7","B7.1",30000,30,"stimata","CASTELNUOVO DI PORTO","NO","Scheda progetto","2017",null,null,null,null,null,0.35,null,null,null,null,null,0,null,0,null,0,null,80000,null,0,null,0,null,80000,0]
[null,166,"ESTENSIONE RETE IDRICA COMUNE DI CAVE","NO","B7","B7.1",30000,110,"stimata","CAVE","NO","Scheda progetto","2017",null,null,null,null,null,0.35,null,null,null,null,null,0,null,0,null,0,null,380000,null,0,null,0,null,380000,0]
[null,167,"ESTENSIONE RETE IDRICA COMUNE DI CERVARA DI ROMA","NO","B7","B7.1",30000,70,"stimata","CERVARA DI ROMA","NO","Scheda progetto","2019",null,null,null,null,null,0.35,null,null,null,null,null,0,null,0,null,0,null,0,null,0,null,250000,null,250000,0]
[null,168,"ESTENSIONE RETE IDRICA COMUNE DI CERVETERI","NO","B7","B7.1",30000,70,"stimata","CERVETERI","NO","Scheda progetto","2017",null,null,null,null,null,0.35,null,null,null,null,null,0,null,0,null,0,null,250000,null,0,null,0,null,250000,0]
[null,169,"POTENZIAMENTO CONDOTTA DISTRIBUTRICE ZONA \"IV KM\" NEL COMUNE DI COLLEFERRO","NO","B7","B7.1",30000,800,"stimata","COLLEFERRO","NO","Scheda progetto","2017",null,null,null,null,null,0.35,null,0,null,0,null,0,null,0,null,0,null,780000,null,0,null,0,null,780000,0]
[null,170,"ESTENSIONE RETE IDRICA COMUNE DI COLLEFERRO","NO","B7","B7.1",30000,60,"stimata","COLLEFERRO","NO","Scheda progetto","2016",null,null,null,null,null,0.35,null,null,null,null,null,0,null,0,null,190000,null,0,null,0,null,0,null,190000,0]
[null,171,"RETE IDRICA E FOGNARIA SU VICOLO COCCIA DI MORTO","NO","B7","B7.1",30000,250,"rilevata","FIUMICINO","NO","Lavori in corso","2018",null,null,null,null,null,0.35,null,0,null,0,null,0,null,0,null,0,null,29006.249999999996,null,53868.75,null,0,null,82875,0]
[null,172,"ESTENSIONE RETE IDRICA COMUNE DI FIUMICINO","NO","B7","B7.1",30000,130,"stimata","FIUMICINO","NO","Scheda progetto","2016",null,null,null,null,null,0.35,null,null,null,null,null,0,null,0,null,440000,null,0,null,0,null,0,null,440000,0]
[null,173,"ESTENSIONE RETE IDRICA COMUNE DI FRASCATI","NO","B7","B7.1",30000,60,"stimata","FRASCATI","NO","Scheda progetto","2017",null,null,null,null,null,0.35,null,null,null,null,null,0,null,0,null,0,null,200000,null,0,null,0,null,200000,0]
[null,174,"AMPLIAMENTO RETE IDRICA COMUNE DI GAVIGNANO I E II LOTTO","NO","B7","B7.1",30000,300,"stimata","GAVIGNANO ","NO","Scheda progetto","OLTRE 2019",null,null,null,null,null,0.35,null,null,null,null,null,0,null,0,null,180000,null,0,null,0,null,0,null,180000,0]
[null,175,"LAVORI PER IL COMPLETAMENTO RETE IDRICA IN LOCALITÀ MACCARECCE","NO","B7","B7.1",30000,500,"stimata","GENAZZANO","NO","Scheda progetto","2018",null,null,null,null,null,0.35,null,0,null,0,null,0,null,0,null,0,null,0,null,1350375,null,0,null,1350375,0]
[null,176,"ESTENSIONE RETE IDRICA COMUNE DI GERANO","NO","B7","B7.1",30000,30,"stimata","GERANO","NO","Scheda progetto","2016",null,null,null,null,null,0.35,null,null,null,null,null,0,null,0,null,100000,null,0,null,0,null,0,null,100000,0]
[null,177,"ESTENSIONE RETE IDRICA COMUNE DI GROTTAFERRATA","NO","B7","B7.1",30000,70,"stimata","GROTTAFERRATA","NO","Scheda progetto","2019",null,null,null,null,null,0.35,null,null,null,null,null,0,null,0,null,0,null,0,null,0,null,250000,null,250000,0]
[null,178,"ALLACCIO IDRICO E FOGNARIO DEL NUOVO PLESSO SCOLASTICO INTERCOMUNALE DELLA VALLE DEL GIOVENZANO","NO","B7","B7.1",30000,500,"stimata","INTERCOMUNALE","NO","Scheda progetto","2017",null,null,null,null,null,0.35,null,0,null,0,null,0,null,0,null,0,null,682500,null,0,null,0,null,682500,0]
[null,179,"CONDOTTE PER UTENZA ROMA","NO","B7","B7.1",30000,940,"stimata","INTERCOMUNALE","NO","Scheda progetto","2019",null,null,null,null,null,0.35,null,null,null,null,null,0,null,0,null,845000,null,845000,null,845000,null,845000,null,3380000,0]
[null,180,"CONDOTTE PER UTENZA FUORI ROMA","NO","B7","B7.1",30000,730,"stimata","INTERCOMUNALE","NO","Scheda progetto","2019",null,null,null,null,null,0.35,null,null,null,null,null,0,null,0,null,650000,null,650000,null,650000,null,650000,null,2600000,0]
[null,181,"RETE IDRICA ALGIDOSA","NO","B7","B7.1",30000,280,"stimata","INTERCOMUNALE","NO","Scheda progetto","2017",null,null,null,null,null,0.35,null,null,null,null,null,0,null,0,null,0,null,1000000,null,0,null,0,null,1000000,0]
[null,182,"ESTENSIONE RETE IDRICA COMUNE DI JENNE","NO","B7","B7.1",30000,40,"stimata","JENNE","NO","Scheda progetto","2016",null,null,null,null,null,0.35,null,null,null,null,null,0,null,0,null,120000,null,0,null,0,null,0,null,120000,0]
[null,183,"ESTENSIONE RETE IDRICA COMUNE DI LANUVIO","NO","B7","B7.1",30000,70,"stimata","LANUVIO","NO","Scheda progetto","2016",null,null,null,null,null,0.35,null,null,null,null,null,0,null,0,null,250000,null,0,null,0,null,0,null,250000,0]
[null,184,"ESTENSIONE RETE IDRICA COMUNE DI MANZIANA","NO","B7","B7.1",30000,30,"stimata","MANZIANA","NO","Scheda progetto","2016",null,null,null,null,null,0.35,null,null,null,null,null,0,null,0,null,100000,null,0,null,0,null,0,null,100000,0]
[null,185,"ESTENSIONE RETE IDRICA COMUNE DI MARCELLINA","NO","B7","B7.1",30000,40,"stimata","MARCELLINA","NO","Scheda progetto","2017",null,null,null,null,null,0.35,null,null,null,null,null,0,null,0,null,70000,null,70000,null,0,null,0,null,140000,0]
[null,186,"ESTENSIONE RETE IDRICA COMUNE DI MONTE PORZIO CATONE","NO","B7","B7.1",30000,70,"stimata","MONTE PORZIO CATONE","NO","Scheda progetto","2017",null,null,null,null,null,0.35,null,null,null,null,null,0,null,0,null,100000,null,150000,null,0,null,0,null,250000,0]
[null,187,"ESTENSIONE RETE IDRICA VIA DELLE CARRARECCE","NO","B7","B7.1",30000,70,"stimata","MONTECOMPATRI","NO","Scheda progetto","2016",null,null,null,null,null,0.35,null,null,null,null,null,0,null,0,null,250000,null,0,null,0,null,0,null,250000,0]
[null,188,"ESTENSIONE RETE IDRICA COMUNE DI MONTELANICO","NO","B7","B7.1",30000,30,"stimata","MONTELANICO ","NO","Scheda progetto","2017",null,null,null,null,null,0.35,null,null,null,null,null,0,null,0,null,0,null,80000,null,0,null,0,null,80000,0]
[null,189,"ESTENSIONE RETE IDRICA COMUNE DI NAZZANO","NO","B7","B7.1",30000,30,"stimata","NAZZANO ","NO","Scheda progetto","2017",null,null,null,null,null,0.35,null,null,null,null,null,0,null,0,null,0,null,80000,null,0,null,0,null,80000,0]
[null,190,"ESTENSIONE RETE IDRICA COMUNE DI OLEVANO","NO","B7","B7.1",30000,70,"stimata","OLEVANO ROMANO","NO","Scheda progetto","2019",null,null,null,null,null,0.35,null,null,null,null,null,0,null,0,null,0,null,0,null,0,null,250000,null,250000,0]
[null,191,"ESTENSIONE RETE IDRICA COMUNE DI ORIOLO ROMANO","NO","B7","B7.1",30000,140,"stimata","ORIOLO ROMANO","NO","Scheda progetto","2016",null,null,null,null,null,0.35,null,null,null,null,null,0,null,0,null,500000,null,0,null,0,null,0,null,500000,0]
[null,192,"ESTENSIONE RETE IDRICA COMUNE DI PALESTRINA","NO","B7","B7.1",30000,30,"stimata","PALESTRINA ","NO","Scheda progetto","2017",null,null,null,null,null,0.35,null,null,null,null,null,0,null,0,null,0,null,100000,null,0,null,0,null,100000,0]
[null,193,"ESTENSIONE RETE IDRICA COMUNE DI RIANO","NO","B7","B7.1",30000,30,"stimata","RIANO ","NO","Scheda progetto","2017",null,null,null,null,null,0.35,null,null,null,null,null,0,null,0,null,0,null,80000,null,0,null,0,null,80000,0]
[null,194,"ESTENSIONE RETE IDRICA COMUNE DI ROCCA CANTERANO","NO","B7","B7.1",30000,70,"stimata","ROCCA CANTERANO","NO","Scheda progetto","2019",null,null,null,null,null,0.35,null,null,null,null,null,0,null,0,null,0,null,0,null,0,null,250000,null,250000,0]
[null,195,"ESTENSIONE RETE IDRICA COMUNE DI ROCCA DI PAPA","NO","B7","B7.1",30000,70,"stimata","ROCCA DI PAPA","NO","Scheda progetto","2016",null,null,null,null,null,0.35,null,null,null,null,null,0,null,0,null,250000,null,0,null,0,null,0,null,250000,0]
[null,196,"ESTENSIONE RETE IDRICA COMUNE DI ROCCA S. STEFANO","NO","B7","B7.1",30000,30,"stimata","ROCCA SANTO STEFANO","NO","Scheda progetto","2016",null,null,null,null,null,0.35,null,null,null,null,null,0,null,0,null,80000,null,0,null,0,null,0,null,80000,0]
[null,197,"ESTENSIONE RETE IDRICA COMUNE DI ROMA","NO","B7","B7.1",30000,1450,"stimata","ROMA","NO","Scheda progetto","2019",null,null,null,null,null,0.35,null,null,null,null,null,0,null,0,null,1300000,null,1300000,null,1300000,null,1300000,null,5200000,0]
[null,198,"REALIZZAZIONE RETE IDRICA E FOGNARIA VIA BOSCO MARENGO - PARTE IDRICA","SI","B7","B7.1",30000,200,"stimata","Roma_13-ex18","SI","Lavori in corso","2016",null,null,null,null,null,0.35,null,4269.8900000000003,null,38342.47,null,0,null,0,null,561971.80850011401,null,0,null,0,null,0,null,561971.80850011401,0]
[null,199,"REALIZZAZIONE RETE IDRICA E FOGNARIA SU VIA CERMENATI E STRADE LIMITROFE - MUNICIPIO IV - PARTE IDRICA","SI","B7","B7.1",30000,1450,"stimata","Roma_13-ex18","SI","Lavori in corso","2016",null,null,null,null,null,0.35,null,787922.6,null,533382.19999999995,null,0,null,0,null,24893.803934999996,null,0,null,0,null,0,null,24893.803934999996,0]
[null,200,"REALIZ. RETE IDRICA E FOGN. LOC. FONTANA ROTTA - CASALE DEL FINOCCHIO (VIII MUN.) - PARTE IDRICA","SI","B7","B7.1",30000,600,"stimata","Roma_13-ex18","NO","Progetto definitivo","2019",null,null,null,null,null,0.35,null,0,null,40209.26,null,0,null,650000,null,0,null,0,null,650000,null,1062214,null,1712214,0]
[null,201,"REALIZ. RETE IDRICA E FOGN. CONSORZI DUE PINI ANGUILLARESE E COLLE DEI PINI ANGUILLARESE - I FASE  - PARTE IDRICA","SI","B7","B7.1",30000,1200,"stimata","Roma_13-ex18","NO","Progetto definitivo","2018",null,null,null,null,null,0.35,null,723.3,null,3282.13,null,390000,null,1040000,null,0,null,500000,null,1369601.5,null,0,null,1869601.5,0]
[null,202,"RETE IDRICA E FOGNARIA CASTEL DI GUIDO - VIA NEVIANI VIA GISMONDI - PARTE IDRICA","SI","B7","B7.1",30000,600,"stimata","Roma_13-ex18","NO","Progetto definitivo","OLTRE 2019",null,null,null,null,null,0.35,null,16405.53,null,64181.36,null,780000,null,2180433.23,null,0,null,0,null,780000,null,1500000,null,2280000,0]
[null,203,"RETE IDRICA MONTEMIGLIORE","SI","B7","B7.1",30000,1100,"stimata","Roma_13-ex18","NO","Progetto definitivo","2019",null,null,null,null,null,0.35,null,32030.26,null,1182.9100000000001,null,0,null,1565752.5,null,0,null,0,null,2000000,null,528955,null,2528955,0]
[null,204,"CONDOTTA IDRICA VIA ARDEATINA","SI","B7","B7.1",30000,500,"stimata","Roma_13-ex18","NO","Progetto preliminare","2017",null,null,null,null,null,0.35,null,null,null,null,null,0,null,0,null,500000,null,959575,null,0,null,0,null,1459575,0]
[null,205,"REALIZZAZIONE RETE IDRICA NEL COMPRENSORIO TORRETTA SITO AL KM 12,5 DI VIA LAURENTINA NEL COMUNE DI ROMA","NO","B7","B7.1",30000,800,"stimata","Roma_13-ex18","NO","Progetto preliminare","2018",null,null,null,null,null,0.35,null,21664.84,null,622.86,null,0,null,0,null,0,null,0,null,721500,null,0,null,721500,0]
[null,206,"ESTENSIONE RETE IDRICA COMUNE DI SACROFANO","NO","B7","B7.1",30000,70,"stimata","SACROFANO","NO","Scheda progetto","2017",null,null,null,null,null,0.35,null,null,null,null,null,0,null,0,null,0,null,250000,null,0,null,0,null,250000,0]
[null,207,"ESTENSIONE RETE IDRICA COMUNE DI SAMBUCI","NO","B7","B7.1",30000,420,"stimata","SAMBUCI","NO","Scheda progetto","2016",null,null,null,null,null,0.35,null,null,null,null,null,0,null,0,null,80000,null,0,null,0,null,0,null,80000,0]
[null,208,"ESTENSIONE RETE IDRICA COMUNE DI SARACINESCO","NO","B7","B7.1",30000,30,"stimata","SARACINESCO","NO","Scheda progetto","2016",null,null,null,null,null,0.35,null,null,null,null,null,0,null,0,null,80000,null,0,null,0,null,0,null,80000,0]
[null,209,"ESTENSIONE RETE IDRICA COMUNE DI SUBIACO","NO","B7","B7.1",30000,120,"stimata","SUBIACO","NO","Scheda progetto","2018",null,null,null,null,null,0.35,null,null,null,null,null,0,null,0,null,0,null,200000,null,200000,null,0,null,400000,0]
[null,210,"ESTENSIONE RETE IDRICA COMUNE DI TOLFA","NO","B7","B7.1",30000,30,"stimata","TOLFA","NO","Scheda progetto","2017",null,null,null,null,null,0.35,null,null,null,null,null,0,null,0,null,0,null,80000,null,0,null,0,null,80000,0]
[null,211,"ESTENSIONE RETE IDRICA COMUNE DI TORRITA TIBERINA","NO","B7","B7.1",30000,70,"stimata","TORRITA TIBERINA","NO","Scheda progetto","2017",null,null,null,null,null,0.35,null,null,null,null,null,0,null,0,null,0,null,250000,null,0,null,0,null,250000,0]
[null,212,"ESTENSIONE RETE IDRICA COMUNE DI TREVIGNANO ROMANO","NO","B7","B7.1",30000,70,"stimata","TREVIGNANO ROMANO","NO","Scheda progetto","2017",null,null,null,null,null,0.35,null,null,null,null,null,0,null,0,null,0,null,250000,null,0,null,0,null,250000,0]
[null,213,"ESTENSIONE RETE IDRICA COMUNE DI VALMONTONE","NO","B7","B7.1",30000,30,"stimata","VALMONTONE","NO","Scheda progetto","2016",null,null,null,null,null,0.35,null,null,null,null,null,0,null,0,null,100000,null,0,null,0,null,0,null,100000,0]
[null,214,"ESTENSIONE RETE IDRICA COMUNE DI VELLETRI","NO","B7","B7.1",30000,70,"stimata","VELLETRI","NO","Scheda progetto","2016",null,null,null,null,null,0.35,null,null,null,null,null,0,null,0,null,250000,null,0,null,0,null,0,null,250000,0]
[null,215,"ESTENSIONE RETE IDRICA COMUNE DI VICOVARO","NO","B7","B7.1",30000,70,"stimata","VICOVARO","NO","Scheda progetto","2017",null,null,null,null,null,0.35,null,null,null,null,null,0,null,0,null,0,null,250000,null,0,null,0,null,250000,0]
[null,216,"ESTENSIONE RETE IDRICA COLLE PALLAVICINI - ZAGAROLO","NO","B7","B7.1",30000,250,"stimata","ZAGAROLO","NO","Scheda progetto","2018",null,null,null,null,null,0.35,null,0,null,0,null,0,null,0,null,0,null,0,null,438750,null,0,null,438750,0]
[null,217,"NUOVO SERBATOIO BELVEDERE","NO","B8","B8.1",1040700,14000,"rilevata","FIANO ROMANO","SI","Lavori in corso","2017",null,null,null,null,null,0,null,38837.25,null,1237.29,null,0,null,0,null,1000000,null,2404017,null,0,null,0,null,3404017,0]
[null,218,"NUOVI SERBATOI LUNGO L'ADD. OLGIATA CIVITAVECCHIA - SERBATOIO FIUMICINO ARANOVA","SI","B8","B8.1",1040700,10000,"rilevata","FIUMICINO","NO","Progetto preliminare","2019",null,null,null,null,null,0,null,81365,null,1029.52,null,2000000,null,3222408,null,0,null,500000,null,3000000,null,2322407.5,null,5822407.5,0]
[null,219,"SERBATOIO CARLO FONTANA, RELATIVI COLLEGAMENTI ED IMPIANTO DI POTABILIZZAZIONE","SI","B8","B8.1",1040700,9800,"rilevata","LANUVIO","SI","Lavori in corso","2016",null,null,null,null,null,0,null,1218538,null,632078.5,null,520327.58700000029,null,0,null,1261327.5870000003,null,0,null,0,null,0,null,{"$f":"SUM(AC228+AE228+AG228+AI228)","v":1261327.5870000003},{"$f":"SUM(AD228+AF228+AH228+AJ228)","v":0}]
[null,220,"NUOVO SERBATOIO \"MACCHIA MICCIA BASSO\"","SI","B8","B8.1",1040700,6900,"rilevata","MARCELLINA","NO","Progetto definitivo","2018",null,null,null,null,null,0,null,577.92999999999995,null,10476.030000000001,null,0,null,390000,null,0,null,1000000,null,1357550,null,0,null,2357550,0]
[null,221,"SECONDA VASCA DEL CENTRO IDRICO CASILINO","SI","B8","B8.1",1040700,500000,"stimata","Roma_13-ex18","NO","Progetto definitivo","OLTRE 2019",null,null,null,null,null,0,null,1664.51,null,4049.32,null,2600000,null,2600000,null,0,null,0,null,2500000,null,2500000,null,5000000,0]
[null,222,"CENTRO IDRICO CASTELL'ARCIONE E RELATIVI COLLEGAMENTI","NO","B8","B8.1",1040700,110000,"stimata","Roma_13-ex18","NO","Progetto definitivo","OLTRE 2019",null,null,null,null,null,0,null,0,null,80.66,null,0,null,0,null,0,null,0,null,0,null,2000000,null,{"$f":"SUM(AC231+AE231+AG231+AI231)","v":2000000},{"$f":"SUM(AD231+AF231+AH231+AJ231)","v":0}]
[null,223,"CENTRO PRENESTINO (SERBATOI E CONDOTTE)","NO","B8","B8.1",1040700,300000,"stimata","Roma_13-ex18","NO","Progetto preliminare","OLTRE 2019",null,null,null,null,null,0,null,175773.5,null,93282.65,null,0,null,0,null,0,null,0,null,0,null,2000000,null,2000000,0]
[null,224,"AMPLIAMENTO SERBATOIO PONTE GALERIA","SI","B8","B8.1",1040700,80000,"stimata","Roma_13-ex18","NO","Progetto definitivo","2018",null,null,null,null,null,0,null,572.54,null,4032.33,null,390000,null,2279598.75,null,0,null,390000,null,2279598.75,null,0,null,2669598.75,0]
[null,225,"NUOVI SERBATOI LUNGO L'ADD. OLGIATA CIVITAVECCHIA - NUOVO SERBATOIO CAMPO SPORTIVO","NO","B8","B8.1",1040700,10000,"rilevata","SANTA MARINELLA","NO","Progetto definitivo","OLTRE 2019",null,null,null,null,null,0,null,0,null,343.49,null,0,null,0,null,0,null,0,null,0,null,475987.5,null,475987.5,0]
[null,226,"ESTENSIONE RETE FOGNARIA COMUNE DI AFFILE","NO","C1","C1.1",86000,50,"stimata","AFFILE","NO","Scheda progetto","2016",null,null,null,null,null,0.33,null,null,null,null,null,0,null,0,null,140000,null,0,null,0,null,0,null,140000,0]
[null,227,"COMPLETAMENTO/ADEGUAMENTO SISTEMA FOGNARIO EX DOCUP 1 E 2 AREA INDUSTRIALE DI PAVONA (PIANI DI MONTE SAVELLO - CANCELLIERA)","NO","C1","C1.1",86000,500,"stimata","ALBANO LAZIALE","NO","Scheda progetto","2019",null,null,null,null,null,0,null,0,null,0,null,0,null,0,null,0,null,0,null,1050000,null,1050000,null,2100000,0]
[null,228,"REALIZZAZIONE CONDOTTA FOGNARIA VIA VALLE POZZO - VIA PIANI DI MONTE SAVELLO","NO","C1","C1.1",86000,500,"stimata","ALBANO LAZIALE","NO","Scheda progetto","2017",null,null,null,null,null,0,null,0,null,0,null,0,null,0,null,0,null,877500,null,0,null,0,null,877500,0]
[null,229,"ESTENSIONE RETE FOGNARIA COMUNE DI ALBANO LAZIALE","NO","C1","C1.1",86000,360,"stimata","ALBANO LAZIALE","NO","Scheda progetto","2019",null,null,null,null,null,0.33,null,null,null,null,null,0,null,0,null,0,null,0,null,500000,null,500000,null,1000000,0]
[null,230,"ESTENSIONE RETE FOGNARIA COMUNE DI ARICCIA","NO","C1","C1.1",86000,220,"stimata","ARICCIA","NO","Scheda progetto","2017",null,null,null,null,null,0.33,null,null,null,null,null,0,null,0,null,100000,null,500000,null,0,null,0,null,600000,0]
[null,231,"ESTENSIONE RETE FOGNARIA COMUNE DI BELLEGRA","NO","C1","C1.1",86000,80,"stimata","BELLEGRA","NO","Scheda progetto","2016",null,null,null,null,null,0.33,null,null,null,null,null,0,null,0,null,200000,null,0,null,0,null,0,null,200000,0]
[null,232,"ESTENSIONE RETE FOGNARIA COMUNE DI CASTELGANDOLFO","NO","C1","C1.1",86000,80,"stimata","CASTEL GANDOLFO","NO","Scheda progetto","2018",null,null,null,null,null,0.33,null,null,null,null,null,0,null,0,null,0,null,100000,null,100000,null,0,null,200000,0]
[null,233,"ESTENSIONE RETE FOGNARIA COMUNE DI CASTEL SAN PIETRO ROMANO","NO","C1","C1.1",86000,150,"stimata","CASTEL SAN PIETRO ROMANO","NO","Scheda progetto","2019",null,null,null,null,null,0.33,null,null,null,null,null,0,null,0,null,0,null,0,null,200000,null,200000,null,400000,0]
[null,234,"ESTENSIONE RETE FOGNARIA COMUNE DI CASTELNUOVO DI PORTO","NO","C1","C1.1",86000,90,"stimata","CASTELNUOVO DI PORTO","NO","Scheda progetto","2016",null,null,null,null,null,0.33,null,null,null,null,null,0,null,0,null,250000,null,0,null,0,null,0,null,250000,0]
[null,235,"ESTENSIONE RETE FOGNARIA COMUNE DI CAVE","NO","C1","C1.1",86000,40,"stimata","CAVE","NO","Scheda progetto","2017",null,null,null,null,null,0.33,null,null,null,null,null,0,null,0,null,0,null,100000,null,0,null,0,null,100000,0]
[null,236,"ESTENSIONE RETE FOGNARIA COMUNE DI CERVETERI","NO","C1","C1.1",86000,180,"stimata","CERVETERI","NO","Scheda progetto","2018",null,null,null,null,null,0.33,null,null,null,null,null,0,null,0,null,0,null,0,null,500000,null,0,null,500000,0]
[null,237,"FOGNATURA VIALE DEL PORTO - III LOTTO","SI","C1","C1.1",86000,300,"rilevata","FIUMICINO","SI","Lavori in corso","2016",null,null,null,null,null,0,null,17687.48,null,758906.1,null,0,null,0,null,303918.18599999999,null,0,null,0,null,0,null,303918.18599999999,0]
[null,238,"RETE IDRICA E FOGNARIA SU VICOLO COCCIA DI MORTO","NO","C1","C1.1",86000,500,"stimata","FIUMICINO","NO","Lavori in corso","2018",null,null,null,null,null,0,null,0,null,0,null,0,null,0,null,0,null,75465,null,301860,null,0,null,377325,0]
[null,239,"RETE FOGNARIA SU VIA MONTI DELL'ARA - MACCARESE","SI","C1","C1.1",86000,300,"rilevata","FIUMICINO","SI","Lavori in corso","2016",null,null,null,null,null,0,null,146461.4,null,1013917,null,0,null,0,null,189814.443,null,0,null,0,null,0,null,189814.443,0]
[null,240,"ESTENSIONE RETE FOGNARIA COMUNE DI FIUMICINO","NO","C1","C1.1",86000,180,"stimata","FIUMICINO","NO","Scheda progetto","2017",null,null,null,null,null,0.33,null,null,null,null,null,0,null,0,null,0,null,500000,null,0,null,0,null,500000,0]
[null,241,"NUOVO COLLETTORE ISOLA SACRA OSTIA","SI","C1","C1.1",86000,10000,"rilevata","FIUMICINO","NO","Scheda progetto","OLTRE 2019",null,null,null,null,null,0,null,536.54,null,181.59,null,0,null,390000,null,0,null,0,null,0,null,1000000,null,1000000,0]
[null,242,"ESTENSIONE RETE FOGNARIA COMUNE DI FONTE NUOVA","NO","C1","C1.1",86000,580,"stimata","FONTENUOVA ","NO","Scheda progetto","2019",null,null,null,null,null,0.33,null,null,null,null,null,0,null,0,null,100000,null,500000,null,500000,null,500000,null,1600000,0]
[null,243,"ESTENSIONE RETE FOGNARIA COMUNE DI FORMELLO","NO","C1","C1.1",86000,80,"stimata","FORMELLO","NO","Scheda progetto","2019",null,null,null,null,null,0.33,null,null,null,null,null,0,null,0,null,0,null,0,null,0,null,200000,null,200000,0]
[null,244,"ESTENSIONE RETE FOGNARIA COMUNE DI FRASCATI","NO","C1","C1.1",86000,540,"stimata","FRASCATI","NO","Scheda progetto","2019",null,null,null,null,null,0.33,null,null,null,null,null,0,null,0,null,0,null,500000,null,500000,null,500000,null,1500000,0]
[null,245,"ESTENSIONE RETE FOGNARIA COMUNE DI GALLICANO NEL LAZIO","NO","C1","C1.1",86000,540,"stimata","GALLICANO NEL LAZIO","NO","Scheda progetto","2019",null,null,null,null,null,0.33,null,null,null,null,null,0,null,0,null,0,null,500000,null,500000,null,500000,null,1500000,0]
[null,246,"LAVORI PER IL COMPLETAMENTO RETE FOGNARIA IN LOCALITÀ MACCARECCE","NO","C1","C1.1",86000,500,"stimata","GENAZZANO","NO","Scheda progetto","2018",null,null,null,null,null,0,null,0,null,0,null,0,null,0,null,0,null,0,null,413731.41224999999,null,0,null,413731.41224999999,0]
[null,247,"ESTENSIONE RETE FOGNARIA COMUNE DI GENZANO DI ROMA","NO","C1","C1.1",86000,600,"stimata","GENZANO DI ROMA","NO","Scheda progetto","2019",null,null,null,null,null,0.33,null,null,null,null,null,0,null,0,null,160000,null,500000,null,500000,null,500000,null,1660000,0]
[null,248,"ESTENSIONE RETE FOGNARIA COMUNE DI GROTTAFERRATA","NO","C1","C1.1",86000,540,"stimata","GROTTAFERRATA","NO","Scheda progetto","2019",null,null,null,null,null,0.33,null,null,null,null,null,0,null,0,null,0,null,500000,null,500000,null,500000,null,1500000,0]
[null,249,"ESTENSIONE RETE FOGNARIA COMUNE DI GUIDONIA MONTECELIO","NO","C1","C1.1",86000,650,"stimata","GUIDONIA MONTECELIO","NO","Scheda progetto","2019",null,null,null,null,null,0.33,null,null,null,null,null,0,null,0,null,90000,null,300000,null,500000,null,500000,null,1390000,0]
[null,250,"ALLACCIO IDRICO E FOGNARIO DEL NUOVO PLESSO SCOLASTICO INTERCOMUNALE DELLA VALLE DEL GIOVENZANO","NO","C1","C1.1",86000,500,"stimata","INTERCOMUNALE","NO","Scheda progetto","2017",null,null,null,null,null,0,null,0,null,0,null,0,null,0,null,0,null,243750,null,0,null,0,null,243750,0]
[null,251,"ESTENSIONE RETE FOGNARIA COMUNE DI LANUVIO","NO","C1","C1.1",86000,540,"stimata","LANUVIO","NO","Scheda progetto","2019",null,null,null,null,null,0.33,null,null,null,null,null,0,null,0,null,0,null,500000,null,500000,null,500000,null,1500000,0]
[null,252,"ESTENSIONE RETE FOGNARIA COMUNE DI LARIANO","NO","C1","C1.1",86000,540,"stimata","LARIANO","NO","Scheda progetto","2019",null,null,null,null,null,0.33,null,null,null,null,null,0,null,0,null,0,null,500000,null,500000,null,500000,null,1500000,0]
[null,253,"FOGN. PROSSIMITA' DI VIA APPIA NUOVA KM 21,00, , VIA CASA ROSSA, VIA NETTUNENSE, ED ELIM. DEP. EX-DALLAS","SI","C1","C1.1",86000,630,"rilevata","MARINO","SI","Lavori in corso","2016",null,null,null,null,null,0,null,2886.34,null,645069.9,null,0,null,0,null,362116.95,null,0,null,0,null,0,null,362116.95,0]
[null,254,"ESTENSIONE RETE FOGNARIA COMUNE DI MARINO","NO","C1","C1.1",86000,80,"stimata","MARINO","NO","Scheda progetto","2019",null,null,null,null,null,0.33,null,null,null,null,null,0,null,0,null,0,null,0,null,0,null,200000,null,{"$f":"SUM(AC263+AE263+AG263+AI263)","v":200000},{"$f":"SUM(AD263+AF263+AH263+AJ263)","v":0}]
[null,255,"ESTENSIONE RETE FOGNARIA COMUNE DI MONTE PORZIO CATONE","NO","C1","C1.1",86000,540,"stimata","MONTE PORZIO CATONE","NO","Scheda progetto","2019",null,null,null,null,null,0.33,null,null,null,null,null,0,null,0,null,0,null,500000,null,500000,null,500000,null,1500000,0]
[null,256,"ESTENSIONE RETE FOGNARIA COMUNE DI MONTE COMPATRI","NO","C1","C1.1",86000,360,"stimata","MONTECOMPATRI","NO","Scheda progetto","2019",null,null,null,null,null,0.33,null,null,null,null,null,0,null,0,null,0,null,0,null,500000,null,500000,null,1000000,0]
[null,257,"ESTENSIONE RETE FOGNARIA COMUNE DI MONTEROTONDO","NO","C1","C1.1",86000,380,"stimata","MONTEROTONDO","NO","Scheda progetto","2019",null,null,null,null,null,0.33,null,null,null,null,null,0,null,0,null,0,null,11000,null,500000,null,500000,null,1011000,0]
[null,258,"ESTENSIONE RETE FOGNARIA ZONA MONTE CARAFA","NO","C1","C1.1",86000,90,"stimata","NAZZANO ","NO","Scheda progetto","2019",null,null,null,null,null,0.33,null,null,null,null,null,0,null,0,null,0,null,0,null,0,null,238875,null,238875,0]
[null,259,"ESTENSIONE RETE FOGNARIA COMUNE DI OLEVANO ROMANO","NO","C1","C1.1",86000,40,"stimata","OLEVANO ROMANO","NO","Scheda progetto","2016",null,null,null,null,null,0.33,null,null,null,null,null,0,null,0,null,100000,null,0,null,0,null,0,null,100000,0]
[null,260,"ESTENSIONE RETE FOGNARIA COMUNE DI PALESTRINA","NO","C1","C1.1",86000,540,"stimata","PALESTRINA ","NO","Scheda progetto","2019",null,null,null,null,null,0.33,null,null,null,null,null,0,null,0,null,0,null,500000,null,500000,null,500000,null,1500000,0]
[null,261,"ESTENSIONE RETE FOGNARIA COMUNE DI POMEZIA","NO","C1","C1.1",86000,540,"stimata","POMEZIA ","NO","Scheda progetto","2019",null,null,null,null,null,0.33,null,null,null,null,null,0,null,0,null,0,null,500000,null,500000,null,500000,null,1500000,0]
[null,262,"ESTENSIONE RETE FOGNARIA COMUNE DI RIANO","NO","C1","C1.1",86000,360,"stimata","RIANO ","NO","Scheda progetto","2018",null,null,null,null,null,0.33,null,null,null,null,null,0,null,0,null,0,null,200000,null,164000,null,0,null,364000,0]
[null,263,"ESTENSIONE RETE FOGNARIA COMUNE DI ROCCA DI PAPA","NO","C1","C1.1",86000,360,"stimata","ROCCA DI PAPA","NO","Scheda progetto","2019",null,null,null,null,null,0.33,null,null,null,null,null,0,null,0,null,0,null,0,null,500000,null,500000,null,1000000,0]
[null,264,"ESTENSIONE RETE FOGNARIA COMUNE DI ROCCA PRIORA","NO","C1","C1.1",86000,540,"stimata","ROCCA PRIORA","NO","Scheda progetto","2019",null,null,null,null,null,0.33,null,null,null,null,null,0,null,0,null,0,null,500000,null,500000,null,500000,null,1500000,0]
[null,265,"ESTENSIONE RETE FOGNARIA COMUNE DI ROMA","NO","C1","C1.1",86000,1250,"stimata","ROMA","NO","Scheda progetto","2019",null,null,null,null,null,0.33,null,null,null,null,null,0,null,0,null,500000,null,1000000,null,1000000,null,1000000,null,3500000,0]
[null,266,"INTERVENTI MUNICIPIO V - REALIZZAZIONE RETE FOGNARIA SU VIA DI PIETRALATA","SI","C1","C1.1",86000,1500,"stimata","Roma_13-ex18","SI","Lavori in corso","2016",null,null,null,null,null,0,null,772636.4,null,515166.4,null,0,null,0,null,39923.806000000011,null,0,null,0,null,0,null,39923.806000000011,0]
[null,267,"REALIZZAZIONE RETE IDRICA E FOGNARIA VIA BOSCO MARENGO - PARTE FOGNARIA","SI","C1","C1.1",86000,200,"stimata","Roma_13-ex18","SI","Lavori in corso","2016",null,null,null,null,null,0,null,4269.8900000000003,null,38342.47,null,0,null,0,null,1311269.8864998859,null,0,null,0,null,0,null,1311269.8864998859,0]
[null,268,"REALIZZAZIONE RETE IDRICA E FOGNARIA SU VIA CERMENATI E STRADE LIMITROFE - MUNICIPIO IV - PARTE FOGNARIA","SI","C1","C1.1",86000,1450,"stimata","Roma_13-ex18","SI","Lavori in corso","2016",null,null,null,null,null,0,null,787922.6,null,533382.19999999995,null,0,null,0,null,39765.427064999989,null,0,null,0,null,0,null,39765.427064999989,0]
[null,269,"REALIZZAZIONE RETE FOGNARIA PRATAPORCI (VIII MUN)","SI","C1","C1.1",86000,250,"stimata","Roma_13-ex18","NO","Progetto definitivo","2017",null,null,null,null,null,0,null,11160.16,null,14259.19,null,0,null,1096387.5,null,0,null,1096387.5,null,0,null,0,null,1096387.5,0]
[null,270,"RETE FOGNARIA ACQUE NERE VIA FORMIA E STRADE LIMITROFE","SI","C1","C1.1",86000,500,"stimata","Roma_13-ex18","NO","Progetto definitivo","2018",null,null,null,null,null,0,null,1702.27,null,4064.59,null,0,null,709507.5,null,0,null,559688.5,null,500000,null,0,null,1059688.5,0]
[null,271,"COMPLETAMENTO FOGNATURA SU VIA DEL MANDRIONE","NO","C1","C1.1",86000,1000,"stimata","Roma_13-ex18","NO","Progetto definitivo","2019",null,null,null,null,null,0,null,0,null,0,null,0,null,0,null,0,null,0,null,0,null,535372.5,null,535372.5,0]
[null,272,"COMPLETAMENTO RETE E COLLETTORE FOGNARIO SUL QUADRANTE DI VIA DEGLI ANGELI","NO","C1","C1.1",86000,100,"stimata","Roma_13-ex18","NO","Progetto definitivo","2017",null,null,null,null,null,0,null,20546.88,null,20859.13,null,0,null,0,null,0,null,926250,null,0,null,0,null,926250,0]
[null,273,"COMPLETAMENTO QUADRANTE DEL PIGNETO (VI MUN)","NO","C1","C1.1",86000,null,null,"Roma_13-ex18","NO","Progetto definitivo","OLTRE 2019",null,null,null,null,null,0,null,0,null,0,null,0,null,0,null,0,null,0,null,0,null,500000,null,500000,0]
[null,274,"RELIZZAZIONE RETE DI FOGNATURA NERA CONSORZIO GIUSTINIANA VIII","SI","C1","C1.1",86000,500,"stimata","Roma_13-ex18","NO","Progetto definitivo","2019",null,null,null,null,null,0,null,6502.32,null,253450.3,null,0,null,1300000,null,0,null,0,null,1300000,null,837200,null,2137200,0]
[null,275,"RISANAMENTO FOGNATURA A SERVIZIO DI VIA CAPALTI E STRADE LIMITROFE","SI","C1","C1.1",86000,500,"stimata","Roma_13-ex18","SI","Lavori in corso","2016",null,null,null,null,null,0,null,199357.1,null,1013581,null,0,null,0,null,417341.00200000004,null,0,null,0,null,0,null,417341.00200000004,0]
[null,276,"REALIZ. RETE IDRICA E FOGN. LOC. FONTANA ROTTA - CASALE DEL FINOCCHIO (VIII MUN.) - PARTE FOGNARIA","SI","C1","C1.1",86000,600,"stimata","Roma_13-ex18","NO","Progetto definitivo","2019",null,null,null,null,null,0,null,0,null,40209.26,null,0,null,650000,null,0,null,0,null,780000,null,969036.00000000012,null,1749036,0]
[null,277,"COMPLETAMENTO RETE DI FOGNATURA IN LOCALITÀ SANTA CORNELIA","NO","C1","C1.1",86000,null,null,"Roma_13-ex18","NO","Progetto definitivo","2019",null,null,null,null,null,0,null,0,null,0,null,0,null,0,null,0,null,0,null,0,null,709800,null,709800,0]
[null,278,"REALIZ. RETE IDRICA E FOGN. CONSORZI DUE PINI ANGUILLARESE E COLLE DEI PINI ANGUILLARESE - I FASE  - PARTE FOGNARIA","SI","C1","C1.1",86000,1200,"stimata","Roma_13-ex18","NO","Progetto definitivo","2019",null,null,null,null,null,0,null,723.3,null,3282.13,null,390000,null,1040000,null,0,null,0,null,900000,null,2604208.5,null,3504208.5,0]
[null,279,"REALIZZAZIONE RETE IDRICA E FOGNARIA IN VIA DI SANTA CORNELIA, VIA SORMANO, VIA LUISIANO E VIA RONCARÒ NEL COMUNE DI ROMA","NO","C1","C1.1",86000,null,null,"Roma_13-ex18","NO","Progetto definitivo","2019",null,null,null,null,null,0,null,0,null,0,null,0,null,0,null,0,null,0,null,0,null,1560000,null,1560000,0]
[null,280,"REALIZZAZIONE RETE FOGNARIA VIA CURIONI (V MUN.)","SI","C1","C1.1",86000,755,"rilevata","Roma_13-ex18","NO","Progetto definitivo","2017",null,null,null,null,null,0,null,361.68,null,211.38,null,0,null,864045,null,0,null,864045,null,0,null,0,null,864045,0]
[null,281,"REALIZZAZIONE RETE IDRICA E FOGNARIA VIA VITTORE CAMELIO","NO","C1","C1.1",86000,null,null,"Roma_13-ex18","NO","Progetto definitivo","2019",null,null,null,null,null,0,null,0,null,0,null,0,null,0,null,0,null,0,null,0,null,726375,null,726375,0]
[null,282,"COMPLETAMENTO RETE FOGNARIA BORGO CESANO","SI","C1","C1.1",86000,2733,"rilevata","Roma_13-ex18","NO","Progetto definitivo","2018",null,null,null,null,null,0,null,602.84,null,144372.1,null,390000,null,1963260,null,0,null,390000,null,1963260,null,0,null,2353260,0]
[null,283,"RETE FOGNARIA PIANO DI ZONA B42 STAGNI DI OSTIA","NO","C1","C1.1",86000,2972,"stimata","Roma_13-ex18","NO","Progetto preliminare","OLTRE 2019",null,null,null,null,null,0,null,131495.9,null,36171.4,null,0,null,0,null,0,null,0,null,0,null,500000,null,500000,0]
[null,284,"RETE IDRICA E FOGNARIA CASTEL DI GUIDO - VIA NEVIANI VIA GISMONDI","SI","C1","C1.1",86000,600,"stimata","Roma_13-ex18","NO","Progetto definitivo","2019",null,null,null,null,null,0,null,16405.53,null,64181.36,null,260000,null,1218058.77,null,0,null,0,null,260000,null,1218058.77,null,1478058.77,0]
[null,285,"REALIZZAZIONE RETE FOGNARIA BORGO S. ISIDORO","SI","C1","C1.1",86000,6000,"stimata","Roma_13-ex18","NO","Progetto definitivo","2018",null,null,null,null,null,0,null,33839.519999999997,null,42642.51,null,390000,null,1560000,null,390000,null,1560000,null,387562.5,null,0,null,2337562.5,0]
[null,286,"ADDUTTRICE ACQUE BIANCHE DEL FOSSO ALMONE-TEVERE","NO","C1","C1.1",86000,null,null,"Roma_8-ex11","NO","Progetto definitivo","OLTRE 2019",null,null,null,null,null,0,null,408.57,null,0,null,0,null,0,null,0,null,0,null,1000000,null,1500000,null,{"$f":"SUM(AC295+AE295+AG295+AI295)","v":2500000},{"$f":"SUM(AD295+AF295+AH295+AJ295)","v":0}]
[null,287,"ESTENSIONE RETE FOGNARIA COMUNE DI SAN CESAREO","NO","C1","C1.1",86000,540,"stimata","SAN CESAREO","NO","Scheda progetto","2019",null,null,null,null,null,0.33,null,null,null,null,null,0,null,0,null,0,null,500000,null,500000,null,500000,null,1500000,0]
[null,288,"ESTENSIONE RETE FOGNARIA COMUNE DI SAN POLO DEI CAVALIERI","NO","C1","C1.1",86000,150,"stimata","SAN POLO DEI CAVALIERI","NO","Scheda progetto","2019",null,null,null,null,null,0.33,null,null,null,null,null,0,null,0,null,0,null,0,null,200000,null,200000,null,400000,0]
[null,289,"NUOVO IMPIANTO DI DEPURAZIONE E RETE FOGNARIA SANTA BALBINA","NO","C1","C1.1",86000,500,"stimata","SAN POLO DEI CAVALIERI","NO","Lavori in corso","2018",null,null,null,null,null,0,null,31769.9,null,1402.48,null,0,null,0,null,0,null,0,null,1462500,null,0,null,1462500,0]
[null,290,"ESTENSIONE RETE FOGNARIA COMUNE DI SAN VITO ROMANO","NO","C1","C1.1",86000,330,"stimata","SAN VITO ROMANO","NO","Scheda progetto","2019",null,null,null,null,null,0.33,null,null,null,null,null,0,null,0,null,0,null,300000,null,300000,null,300000,null,900000,0]
[null,291,"RETE FOGNARIA COLFIORITO - BELVEDERE","NO","C1","C1.1",86000,500,"rilevata","SANTA MARINELLA","NO","Scheda progetto","2018",null,null,null,null,null,0,null,0,null,78159.990000000005,null,0,null,0,null,0,null,803400,null,1205100,null,0,null,2008500,0]
[null,292,"ESTENSIONE RETE FOGNARIA COMUNE DI SANTA MARINELLA","NO","C1","C1.1",86000,360,"stimata","SANTA MARINELLA","NO","Scheda progetto","2019",null,null,null,null,null,0.33,null,null,null,null,null,0,null,0,null,0,null,0,null,500000,null,500000,null,1000000,0]
[null,293,"ESTENSIONE RETE FOGNARIA COMUNE DI SARACINESCO","NO","C1","C1.1",86000,90,"stimata","SARACINESCO","NO","Scheda progetto","2017",null,null,null,null,null,0.33,null,null,null,null,null,0,null,0,null,0,null,250000,null,0,null,0,null,250000,0]
[null,294,"ESTENSIONE RETE FOGNARIA COMUNE DI SEGNI","NO","C1","C1.1",86000,50,"stimata","SEGNI","NO","Scheda progetto","2017",null,null,null,null,null,0.33,null,null,null,null,null,0,null,0,null,0,null,130000,null,0,null,0,null,130000,0]
[null,295,"ESTENSIONE RETE FOGNARIA COMUNE DI SUBIACO","NO","C1","C1.1",86000,20,"stimata","SUBIACO","NO","Scheda progetto","2016",null,null,null,null,null,0.33,null,null,null,null,null,0,null,0,null,50000,null,0,null,0,null,0,null,50000,0]
[null,296,"ESTENSIONE RETE FOGNARIA COMUNE DI TIVOLI","NO","C1","C1.1",86000,430,"stimata","TIVOLI","NO","Scheda progetto","2018",null,null,null,null,null,0.33,null,null,null,null,null,0,null,0,null,200000,null,500000,null,500000,null,0,null,1200000,0]
[null,297,"ESTENSIONE RETE FOGNARIA COMUNE DI TOLFA","NO","C1","C1.1",86000,250,"stimata","TOLFA","NO","Scheda progetto","2017",null,null,null,null,null,0.33,null,null,null,null,null,0,null,0,null,350000,null,350000,null,0,null,0,null,700000,0]
[null,298,"ESTENSIONE RETE FOGNARIA COMUNE DI VELLETRI","NO","C1","C1.1",86000,930,"stimata","VELLETRI","NO","Scheda progetto","2019",null,null,null,null,null,0.33,null,null,null,null,null,0,null,0,null,200000,null,800000,null,800000,null,800000,null,2600000,0]
[null,299,"ESTENSIONE RETE FOGNARIA COMUNE DI VICOVARO","NO","C1","C1.1",86000,50,"stimata","VICOVARO","NO","Scheda progetto","2016",null,null,null,null,null,0.33,null,null,null,null,null,0,null,0,null,130000,null,0,null,0,null,0,null,130000,0]
[null,300,"ESTENSIONE RETE ZAGAROLO FOGNARIO","NO","C1","C1.1",86000,4000,"stimata","ZAGAROLO","NO","Scheda progetto","OLTRE 2019",null,null,null,null,null,0,null,0,null,42461.72,null,0,null,0,null,0,null,0,null,500000,null,0,null,500000,0]
[null,301,"BONIFICA RETE FOGNARIA COMUNE DI AFFILE","NO","C2","C2.1",3600000,120,"stimata","AFFILE","NO","Scheda progetto","2019",null,null,null,null,null,7.0000000000000007E-2,null,null,null,null,null,0,null,0,null,0,null,0,null,0,null,260000,null,260000,0]
[null,302,"BONIFICA RETE FOGNARIA COMUNE DI ALBANO LAZIALE ","NO","C2","C2.1",3600000,60,"stimata","ALBANO LAZIALE","NO","Scheda progetto","2017",null,null,null,null,null,7.0000000000000007E-2,null,null,null,null,null,0,null,0,null,0,null,120000,null,0,null,0,null,120000,0]
[null,303,"BONIFICA RETE FOGNARIA COMUNE DI ALLUMIERE ","NO","C2","C2.1",3600000,120,"stimata","ALLUMIERE","NO","Scheda progetto","2019",null,null,null,null,null,7.0000000000000007E-2,null,null,null,null,null,0,null,0,null,0,null,0,null,0,null,260000,null,260000,0]
[null,304,"BONIFICA RETE FOGNARIA COMUNE DI ARCINAZZO ROMANO ","NO","C2","C2.1",3600000,30,"stimata","ARCINAZZO ROMANO","NO","Scheda progetto","2019",null,null,null,null,null,7.0000000000000007E-2,null,null,null,null,null,0,null,0,null,0,null,0,null,0,null,50000,null,50000,0]
[null,305,"BONIFICA RETE FOGNARIA COMUNE DI ARICCIA ","NO","C2","C2.1",3600000,60,"stimata","ARICCIA","NO","Scheda progetto","2017",null,null,null,null,null,7.0000000000000007E-2,null,null,null,null,null,0,null,0,null,0,null,140000,null,0,null,0,null,140000,0]
[null,306,"BONIFICA RETE FOGNARIA COMUNE DI ARTENA ","NO","C2","C2.1",3600000,40,"stimata","ARTENA","NO","Scheda progetto","2018",null,null,null,null,null,7.0000000000000007E-2,null,null,null,null,null,0,null,0,null,0,null,0,null,90000,null,0,null,90000,0]
[null,307,"BONIFICA RETE FOGNARIA COMUNE DI BELLEGRA ","NO","C2","C2.1",3600000,30,"stimata","BELLEGRA","NO","Scheda progetto","2016",null,null,null,null,null,7.0000000000000007E-2,null,null,null,null,null,0,null,0,null,60000,null,0,null,0,null,0,null,60000,0]
[null,308,"BONIFICA RETE FOGNARIA COMUNE DI CAPRANICA PRENESTINA ","NO","C2","C2.1",3600000,30,"stimata","CAPRANICA PRENESTINA","NO","Scheda progetto","2019",null,null,null,null,null,7.0000000000000007E-2,null,null,null,null,null,0,null,0,null,0,null,0,null,0,null,50000,null,50000,0]
[null,309,"BONIFICA RETE FOGNARIA COMUNE DI CARPINETO ROMANO ","NO","C2","C2.1",3600000,50,"stimata","CARPINETO ROMANO","NO","Scheda progetto","2016",null,null,null,null,null,7.0000000000000007E-2,null,null,null,null,null,0,null,0,null,100000,null,0,null,0,null,0,null,100000,0]
[null,310,"BONIFICA RETE FOGNARIA COMUNE DI CASAPE ","NO","C2","C2.1",3600000,30,"stimata","CASAPE","NO","Scheda progetto","2019",null,null,null,null,null,7.0000000000000007E-2,null,null,null,null,null,0,null,0,null,0,null,0,null,0,null,50000,null,50000,0]
[null,311,"BONIFICA RETE FOGNARIA COMUNE DI CASTELGANDOLFO ","NO","C2","C2.1",3600000,50,"stimata","CASTEL GANDOLFO","NO","Scheda progetto","2019",null,null,null,null,null,7.0000000000000007E-2,null,null,null,null,null,0,null,0,null,0,null,0,null,0,null,110000,null,110000,0]
[null,312,"BONIFICA RETE FOGNARIA COMUNE DI CASTEL MADAMA ","NO","C2","C2.1",3600000,120,"stimata","CASTEL MADAMA","NO","Scheda progetto","2018",null,null,null,null,null,7.0000000000000007E-2,null,null,null,null,null,0,null,0,null,0,null,160000,null,110000,null,0,null,270000,0]
[null,313,"BONIFICA RETE FOGNARIA COMUNE DI CASTEL SAN PIETRO ROMANO ","NO","C2","C2.1",3600000,50,"stimata","CASTEL SAN PIETRO ROMANO","NO","Scheda progetto","2017",null,null,null,null,null,7.0000000000000007E-2,null,null,null,null,null,0,null,0,null,0,null,100000,null,0,null,0,null,100000,0]
[null,314,"BONIFICA RETE FOGNARIA COMUNE DI CASTELNUOVO DI PORTO ","NO","C2","C2.1",3600000,50,"stimata","CASTELNUOVO DI PORTO","NO","Scheda progetto","2017",null,null,null,null,null,7.0000000000000007E-2,null,null,null,null,null,0,null,0,null,0,null,100000,null,0,null,0,null,100000,0]
[null,315,"BONIFICA RETE FOGNARIA COMUNE DI CAVE ","NO","C2","C2.1",3600000,30,"stimata","CAVE","NO","Scheda progetto","2018",null,null,null,null,null,7.0000000000000007E-2,null,null,null,null,null,0,null,0,null,0,null,0,null,70000,null,0,null,70000,0]
[null,316,"BONIFICA RETE FOGNARIA COMUNE DI CERVARA DI ROMA ","NO","C2","C2.1",3600000,50,"stimata","CERVARA DI ROMA","NO","Scheda progetto","2017",null,null,null,null,null,7.0000000000000007E-2,null,null,null,null,null,0,null,0,null,0,null,100000,null,0,null,0,null,100000,0]
[null,317,"RIPRISTINO CONDOTTA FOGNARIA E RELATIVI MANUFATTI (VIA DEL LAVATORE)","NO","C2","C2.1",3600000,50,"rilevata","CERVETERI","NO","Scheda progetto","2017",null,null,null,null,null,7.0000000000000007E-2,null,0,null,8162.9,null,0,null,0,null,0,null,200000,null,0,null,0,null,200000,0]
[null,318,"BONIFICA RETE FOGNARIA COMUNE DI CERVETERI","NO","C2","C2.1",3600000,120,"stimata","CERVETERI","NO","Scheda progetto","2018",null,null,null,null,null,7.0000000000000007E-2,null,null,null,null,null,0,null,0,null,0,null,0,null,260000,null,0,null,{"$f":"SUM(AC327+AE327+AG327+AI327)","v":260000},{"$f":"SUM(AD327+AF327+AH327+AJ327)","v":0}]
[null,319,"BONIFICA RETE FOGNARIA COMUNE DI CIAMPINO ","NO","C2","C2.1",3600000,50,"stimata","CIAMPINO","NO","Scheda progetto","2018",null,null,null,null,null,7.0000000000000007E-2,null,null,null,null,null,0,null,0,null,0,null,0,null,100000,null,0,null,100000,0]
[null,320,"BONIFICA RETE FOGNARIA COMUNE DI CICILIANO ","NO","C2","C2.1",3600000,50,"stimata","CICILIANO","NO","Scheda progetto","2017",null,null,null,null,null,7.0000000000000007E-2,null,null,null,null,null,0,null,0,null,0,null,100000,null,0,null,0,null,100000,0]
[null,321,"BONIFICA RETE FOGNARIA COMUNE DI COLLEFERRO","NO","C2","C2.1",3600000,60,"stimata","COLLEFERRO","NO","Scheda progetto","2019",null,null,null,null,null,7.0000000000000007E-2,null,null,null,null,null,0,null,0,null,0,null,0,null,0,null,130000,null,130000,0]
[null,322,"BONIFICA RETE FOGNARIA COMUNE DI COLONNA ","NO","C2","C2.1",3600000,120,"stimata","COLONNA","NO","Scheda progetto","2019",null,null,null,null,null,7.0000000000000007E-2,null,null,null,null,null,0,null,0,null,0,null,0,null,160000,null,110000,null,270000,0]
[null,323,"BONIFICA RETE FOGNARIA COMUNE DI FIANO ROMANO ","NO","C2","C2.1",3600000,120,"stimata","FIANO ROMANO","NO","Scheda progetto","2019",null,null,null,null,null,7.0000000000000007E-2,null,null,null,null,null,0,null,0,null,0,null,0,null,160000,null,110000,null,270000,0]
[null,324,"BONIFICA RETE FOGNARIA COMUNE DI FILACCIANO ","NO","C2","C2.1",3600000,50,"stimata","FILACCIANO ","NO","Scheda progetto","2016",null,null,null,null,null,7.0000000000000007E-2,null,null,null,null,null,0,null,0,null,100000,null,0,null,0,null,0,null,100000,0]
[null,325,"BONIFICA RETE FOGNARIA COMUNE DI FIUMICINO ","NO","C2","C2.1",3600000,300,"stimata","FIUMICINO","NO","Scheda progetto","2019",null,null,null,null,null,7.0000000000000007E-2,null,null,null,null,null,0,null,0,null,0,null,0,null,0,null,700000,null,700000,0]
[null,326,"BONIFICA RETE FOGNARIA COMUNE DI FONTENUOVA ","NO","C2","C2.1",3600000,110,"stimata","FONTENUOVA ","NO","Scheda progetto","2018",null,null,null,null,null,7.0000000000000007E-2,null,null,null,null,null,0,null,0,null,0,null,0,null,250000,null,0,null,250000,0]
[null,327,"BONIFICA RETE FOGNARIA COMUNE DI FORMELLO","NO","C2","C2.1",3600000,50,"stimata","FORMELLO","NO","Scheda progetto","2018",null,null,null,null,null,7.0000000000000007E-2,null,null,null,null,null,0,null,0,null,0,null,0,null,110000,null,0,null,110000,0]
[null,328,"ELIMINAZIONE SOLLEVAMENTO ROSCIOLO","NO","C2","C2.1",3600000,220,"stimata","FORMELLO","NO","Scheda progetto","2016",null,null,null,null,null,7.0000000000000007E-2,null,null,null,null,null,0,null,0,null,500000,null,0,null,0,null,0,null,500000,0]
[null,329,"BONIFICA RETE FOGNARIA COMUNE DI FRASCATI ","NO","C2","C2.1",3600000,50,"stimata","FRASCATI","NO","Scheda progetto","2018",null,null,null,null,null,7.0000000000000007E-2,null,null,null,null,null,0,null,0,null,0,null,0,null,100000,null,0,null,100000,0]
[null,330,"BONIFICA RETE FOGNARIA COMUNE DI GALLICANO NEL LAZIO ","NO","C2","C2.1",3600000,30,"stimata","GALLICANO NEL LAZIO","NO","Scheda progetto","2019",null,null,null,null,null,7.0000000000000007E-2,null,null,null,null,null,0,null,0,null,0,null,0,null,0,null,60000,null,60000,0]
[null,331,"BONIFICA RETE FOGNARIA COMUNE DI GAVIGNANO ","NO","C2","C2.1",3600000,30,"stimata","GAVIGNANO ","NO","Scheda progetto","2017",null,null,null,null,null,7.0000000000000007E-2,null,null,null,null,null,0,null,0,null,0,null,50000,null,0,null,0,null,50000,0]
[null,332,"RIFACIMENTO SCARICO FOGNARIO SU ALVEO DEL FOSSO RIO NEL COMUNE DI GENAZZANO","NO","C2","C2.1",3600000,40,"stimata","GENAZZANO","NO","Scheda progetto","2017",null,null,null,null,null,7.0000000000000007E-2,null,0,null,0,null,0,null,0,null,0,null,78000,null,0,null,0,null,78000,0]
[null,333,"BONIFICA RETE FOGNARIA COMUNE DI GENAZZANO ","NO","C2","C2.1",3600000,120,"stimata","GENAZZANO","NO","Scheda progetto","2017",null,null,null,null,null,7.0000000000000007E-2,null,null,null,null,null,0,null,0,null,160000,null,110000,null,0,null,0,null,270000,0]
[null,334,"BONIFICA RETE FOGNARIA COMUNE DI GENZANO DI ROMA ","NO","C2","C2.1",3600000,40,"stimata","GENZANO DI ROMA","NO","Scheda progetto","2018",null,null,null,null,null,7.0000000000000007E-2,null,null,null,null,null,0,null,0,null,0,null,0,null,90000,null,0,null,90000,0]
[null,335,"BONIFICA RETE FOGNARIA COMUNE DI GORGA ","NO","C2","C2.1",3600000,120,"stimata","GORGA ","NO","Scheda progetto","2019",null,null,null,null,null,7.0000000000000007E-2,null,null,null,null,null,0,null,0,null,0,null,0,null,160000,null,110000,null,270000,0]
[null,336,"BONIFICA RETE FOGNARIA COMUNE DI GROTTAFERRATA ","NO","C2","C2.1",3600000,180,"stimata","GROTTAFERRATA","NO","Scheda progetto","2018",null,null,null,null,null,7.0000000000000007E-2,null,null,null,null,null,0,null,0,null,0,null,200000,null,200000,null,0,null,400000,0]
[null,337,"BONIFICA RETE FOGNARIA COMUNE DI GUIDONIA ","NO","C2","C2.1",3600000,90,"stimata","GUIDONIA MONTECELIO","NO","Scheda progetto","2017",null,null,null,null,null,7.0000000000000007E-2,null,null,null,null,null,0,null,0,null,0,null,210000,null,0,null,0,null,210000,0]
[null,338,"BONIFICA SISTEMA DI COLLETTAMENTO FOGNARIO AFFERENTE AL DEPURATORE CONSORTILE SITO NEL TERRITORIO COMUNALE DI CICILIANO","NO","C2","C2.1",3600000,1500,"stimata","INTERCOMUNALE","NO","Scheda progetto","2016",null,null,null,null,null,7.0000000000000007E-2,null,0,null,0,null,0,null,0,null,1048125,null,0,null,0,null,0,null,1048125,0]
[null,339,"PIANO DI VIDEOISPEZIONI PROGRAMMATE","NO","C2","C2.1",3600000,3600000,"stimata","INTERCOMUNALE","NO","Scheda progetto","2019",null,null,null,null,null,7.0000000000000007E-2,null,null,null,null,null,0,null,0,null,1200000,null,1200000,null,1200000,null,1200000,null,4800000,0]
[null,340,"MANUTENZIONE ALLACCI FOGNARI","NO","C2","C2.1",3600000,5120,"stimata","INTERCOMUNALE","N.A.",null,"2019",null,null,null,null,null,7.0000000000000007E-2,null,null,null,null,null,0,null,0,null,3000000,null,3000000,null,3000000,null,3000000,null,12000000,0]
[null,341,"POTENZIAMENTO COLLETTORE COBIS","SI","C2","C2.1",3600000,36000,"rilevata","INTERCOMUNALE","NO","Lavori in corso","OLTRE 2019",null,null,null,null,null,7.0000000000000007E-2,null,361.68,null,0,null,0,null,390000,null,0,null,0,null,1500000,null,1500000,null,3000000,0]
[null,342,"RINNOVO/POTENZIAMENTO CIRCUMLACUALE","NO","C2","C2.1",3600000,1110,"stimata","INTERCOMUNALE","NO","Scheda progetto","2018",null,null,null,null,null,7.0000000000000007E-2,null,361.68,null,0,null,0,null,0,null,800000,null,910000,null,890000,null,0,null,2600000,0]
[null,343,"BONIFICA RETE FOGNARIA COMUNE DI JENNE ","NO","C2","C2.1",3600000,30,"stimata","JENNE ","NO","Scheda progetto","2018",null,null,null,null,null,7.0000000000000007E-2,null,null,null,null,null,0,null,0,null,0,null,0,null,50000,null,0,null,50000,0]
[null,344,"BONIFICA RETE FOGNARIA COMUNE DI LANUVIO ","NO","C2","C2.1",3600000,30,"stimata","LANUVIO","NO","Scheda progetto","2016",null,null,null,null,null,7.0000000000000007E-2,null,null,null,null,null,0,null,0,null,60000,null,0,null,0,null,0,null,60000,0]
[null,345,"BONIFICA RETE FOGNARIA COMUNE DI LARIANO ","NO","C2","C2.1",3600000,30,"stimata","LARIANO","NO","Scheda progetto","2018",null,null,null,null,null,7.0000000000000007E-2,null,null,null,null,null,0,null,0,null,0,null,0,null,50000,null,0,null,50000,0]
[null,346,"BONIFICA RETE FOGNARIA COMUNE DI MANZIANA","NO","C2","C2.1",3600000,50,"stimata","MANZIANA","NO","Scheda progetto","2019",null,null,null,null,null,7.0000000000000007E-2,null,null,null,null,null,0,null,0,null,0,null,0,null,0,null,100000,null,100000,0]
[null,347,"BONIFICA RETE FOGNARIA COMUNE DI MARCELLINA ","NO","C2","C2.1",3600000,40,"stimata","MARCELLINA","NO","Scheda progetto","2019",null,null,null,null,null,7.0000000000000007E-2,null,null,null,null,null,0,null,0,null,0,null,0,null,0,null,90000,null,90000,0]
[null,348,"BONIFICA RETE FOGNARIA COMUNE DI MARINO ","NO","C2","C2.1",3600000,230,"stimata","MARINO","NO","Scheda progetto","2017",null,null,null,null,null,7.0000000000000007E-2,null,null,null,null,null,0,null,0,null,0,null,520000,null,0,null,0,null,520000,0]
[null,349,"BONIFICA RETE FOGNARIA COMUNE DI MENTANA ","NO","C2","C2.1",3600000,230,"stimata","MENTANA","NO","Scheda progetto","2018",null,null,null,null,null,7.0000000000000007E-2,null,null,null,null,null,0,null,0,null,0,null,0,null,520000,null,0,null,520000,0]
[null,350,"BONIFICA RETE FOGNARIA COMUNE DI MONTE PORZIO CATONE ","NO","C2","C2.1",3600000,40,"stimata","MONTE PORZIO CATONE","NO","Scheda progetto","2019",null,null,null,null,null,7.0000000000000007E-2,null,null,null,null,null,0,null,0,null,0,null,0,null,0,null,80000,null,80000,0]
[null,351,"BONIFICA RETE FOGNARIA COMUNE DI MONTE COMPATRI ","NO","C2","C2.1",3600000,120,"stimata","MONTECOMPATRI","NO","Scheda progetto","2019",null,null,null,null,null,7.0000000000000007E-2,null,null,null,null,null,0,null,0,null,0,null,0,null,0,null,260000,null,260000,0]
[null,352,"BONIFICA RETE FOGNARIA COMUNE DI MONTELANICO ","NO","C2","C2.1",3600000,30,"stimata","MONTELANICO ","NO","Scheda progetto","2018",null,null,null,null,null,7.0000000000000007E-2,null,null,null,null,null,0,null,0,null,0,null,0,null,50000,null,0,null,50000,0]
[null,353,"RISANAMENTO DELLA RETE FOGNARIA AFFERENTE AL DEPURATORE SCOPPIO - COMUNE DI MONTEROTONDO","NO","C2","C2.1",3600000,20000,"stimata","MONTEROTONDO","SI","Scheda progetto","2017",null,null,null,null,null,7.0000000000000007E-2,null,0,null,19931.71,null,0,null,0,null,97500,null,706875,null,0,null,0,null,804375,0]
[null,354,"BONIFICA RETE FOGNARIA COMUNE DI MONTEROTONDO ","NO","C2","C2.1",3600000,70,"stimata","MONTEROTONDO","NO","Scheda progetto","2018",null,null,null,null,null,7.0000000000000007E-2,null,null,null,null,null,0,null,0,null,0,null,0,null,150000,null,0,null,150000,0]
[null,355,"BONIFICA RETE FOGNARIA COMUNE DI NAZZANO ","NO","C2","C2.1",3600000,130,"stimata","NAZZANO ","NO","Scheda progetto","2017",null,null,null,null,null,7.0000000000000007E-2,null,null,null,null,null,0,null,0,null,0,null,300000,null,0,null,0,null,300000,0]
[null,356,"BONIFICA RETE FOGNARIA COMUNE DI NEMI ","NO","C2","C2.1",3600000,50,"stimata","NEMI","NO","Scheda progetto","2019",null,null,null,null,null,7.0000000000000007E-2,null,null,null,null,null,0,null,0,null,0,null,0,null,0,null,110000,null,110000,0]
[null,357,"BONIFICA RETE FOGNARIA COMUNE DI OLEVANO ROMANO ","NO","C2","C2.1",3600000,120,"stimata","OLEVANO ROMANO","NO","Scheda progetto","2017",null,null,null,null,null,7.0000000000000007E-2,null,null,null,null,null,0,null,0,null,0,null,260000,null,0,null,0,null,260000,0]
[null,358,"BONIFICA RETE FOGNARIA COMUNE DI ORIOLO ROMANO ","NO","C2","C2.1",3600000,30,"stimata","ORIOLO ROMANO","NO","Scheda progetto","2019",null,null,null,null,null,7.0000000000000007E-2,null,null,null,null,null,0,null,0,null,0,null,0,null,0,null,50000,null,50000,0]
[null,359,"BONIFICA RETE FOGNARIA COMUNE DI PALESTRINA ","NO","C2","C2.1",3600000,230,"stimata","PALESTRINA ","NO","Scheda progetto","2016",null,null,null,null,null,7.0000000000000007E-2,null,null,null,null,null,0,null,0,null,520000,null,0,null,0,null,0,null,520000,0]
[null,360,"BONIFICA RETE FOGNARIA COMUNE DI PISONIANO ","NO","C2","C2.1",3600000,120,"stimata","PISONIANO","NO","Scheda progetto","2018",null,null,null,null,null,7.0000000000000007E-2,null,null,null,null,null,0,null,0,null,0,null,160000,null,110000,null,0,null,270000,0]
[null,361,"BONIFICA RETE FOGNARIA COMUNE DI POLI ","NO","C2","C2.1",3600000,120,"stimata","POLI","NO","Scheda progetto","2018",null,null,null,null,null,7.0000000000000007E-2,null,null,null,null,null,0,null,0,null,0,null,160000,null,110000,null,0,null,270000,0]
[null,362,"BONIFICA RETE FOGNARIA COMUNE DI POMEZIA ","NO","C2","C2.1",3600000,90,"stimata","POMEZIA ","NO","Scheda progetto","2019",null,null,null,null,null,7.0000000000000007E-2,null,null,null,null,null,0,null,0,null,0,null,0,null,0,null,210000,null,210000,0]
[null,363,"BONIFICA RETE FOGNARIA COMUNE DI PONZANO ROMANO ","NO","C2","C2.1",3600000,30,"stimata","PONZANO ROMANO ","NO","Scheda progetto","2019",null,null,null,null,null,7.0000000000000007E-2,null,null,null,null,null,0,null,0,null,0,null,0,null,0,null,50000,null,50000,0]
[null,364,"BONIFICA RETE FOGNARIA COMUNE DI RIANO ","NO","C2","C2.1",3600000,120,"stimata","RIANO ","NO","Scheda progetto","2018",null,null,null,null,null,7.0000000000000007E-2,null,null,null,null,null,0,null,0,null,0,null,0,null,260000,null,0,null,260000,0]
[null,365,"BONIFICA RETE FOGNARIA COMUNE DI ROCCA DI CAVE ","NO","C2","C2.1",3600000,30,"stimata","ROCCA DI CAVE","NO","Scheda progetto","2019",null,null,null,null,null,7.0000000000000007E-2,null,null,null,null,null,0,null,0,null,0,null,0,null,0,null,50000,null,50000,0]
[null,366,"BONIFICA RETE FOGNARIA COMUNE DI ROCCA DI PAPA","NO","C2","C2.1",3600000,40,"stimata","ROCCA DI PAPA","NO","Scheda progetto","2017",null,null,null,null,null,7.0000000000000007E-2,null,null,null,null,null,0,null,0,null,0,null,80000,null,0,null,0,null,80000,0]
[null,367,"BONIFICA RETE FOGNARIA COMUNE DI ROCCA PRIORA","NO","C2","C2.1",3600000,30,"stimata","ROCCA PRIORA","NO","Scheda progetto","2019",null,null,null,null,null,7.0000000000000007E-2,null,null,null,null,null,0,null,0,null,0,null,0,null,0,null,50000,null,50000,0]
[null,368,"BONIFICA RETE FOGNARIA COMUNE DI ROCCA S. STEFANO ","NO","C2","C2.1",3600000,50,"stimata","ROCCA SANTO STEFANO","NO","Scheda progetto","2016",null,null,null,null,null,7.0000000000000007E-2,null,null,null,null,null,0,null,0,null,100000,null,0,null,0,null,0,null,100000,0]
[null,369,"BONIFICA RETE FOGNARIA COMUNE DI ROIATE ","NO","C2","C2.1",3600000,50,"stimata","ROIATE","NO","Scheda progetto","2016",null,null,null,null,null,7.0000000000000007E-2,null,null,null,null,null,0,null,0,null,100000,null,0,null,0,null,0,null,100000,0]
[null,370,"REVAMPING IMPIANTI PER LA PROTEZIONE IDRAULICA DEL SISTEMA FOGNARIO","NO","C2","C2.1",3600000,1540,"stimata","ROMA","NO","Scheda progetto","OLTRE 2019",null,null,null,null,null,7.0000000000000007E-2,null,null,null,null,null,0,null,0,null,500000,null,500000,null,500000,null,500000,null,2000000,0]
[null,371,"BONIFICA RETE FOGNARIA COMUNE DI ROMA ","NO","C2","C2.1",3600000,4740,"stimata","ROMA","NO","Scheda progetto","2019",null,null,null,null,null,7.0000000000000007E-2,null,null,null,null,null,0,null,0,null,2000000,null,3500000,null,5000000,null,8000000,null,18500000,0]
[null,372,"RIFACIMENTO RETE FOGNARIA MISTA LOCALITÀ OTTAVIA (XIX MUN.)","SI","C2","C2.1",3600000,1700,"stimata","Roma_13-ex18","NO","Progetto definitivo","2018",null,null,null,null,null,7.0000000000000007E-2,null,849.19,null,372.69,null,0,null,566475,null,0,null,0,null,566475,null,0,null,566475,0]
[null,373,"RIFACIMENTO E SISTEMAZIONE DEL CANALE DEL DERIVATORE DI S. BASILIO","SI","C2","C2.1",3600000,null,null,"Roma_4-ex5","NO","Progetto esecutivo","2016",null,null,null,null,null,7.0000000000000007E-2,null,19386.16,null,1744.1,null,468065,null,0,null,650325,null,0,null,0,null,0,null,650325,0]
[null,374,"RIPRISTINO FOGNATURA DN500 DI SELVOTTA SPONDA FOSSO RADICELLI","NO","C2","C2.1",3600000,null,null,"Roma_9-ex12","NO","Scheda progetto","2016",null,null,null,null,null,7.0000000000000007E-2,null,null,null,null,null,0,null,0,null,292500,null,0,null,0,null,0,null,292500,0]
[null,375,"BONIFICA RETE FOGNARIA COMUNE DI SACROFANO ","NO","C2","C2.1",3600000,30,"stimata","SACROFANO","NO","Scheda progetto","2018",null,null,null,null,null,7.0000000000000007E-2,null,null,null,null,null,0,null,0,null,0,null,0,null,50000,null,0,null,50000,0]
[null,376,"BONIFICA RETE FOGNARIA COMUNE DI SAMBUCI ","NO","C2","C2.1",3600000,30,"stimata","SAMBUCI","NO","Scheda progetto","2018",null,null,null,null,null,7.0000000000000007E-2,null,null,null,null,null,0,null,0,null,0,null,0,null,50000,null,0,null,50000,0]
[null,377,"BONIFICA RETE FOGNARIA COMUNE DI SAN CESAREO ","NO","C2","C2.1",3600000,30,"stimata","SAN CESAREO","NO","Scheda progetto","2018",null,null,null,null,null,7.0000000000000007E-2,null,null,null,null,null,0,null,0,null,0,null,0,null,50000,null,0,null,50000,0]
[null,378,"BONIFICA RETE FOGNARIA COMUNE DI S.GREGORIO ","NO","C2","C2.1",3600000,170,"stimata","SAN GREGORIO DA SASSOLA","NO","Scheda progetto","2019",null,null,null,null,null,7.0000000000000007E-2,null,null,null,null,null,0,null,0,null,0,null,0,null,260000,null,130000,null,390000,0]
[null,379,"BONIFICA RETE FOGNARIA COMUNE DI S. POLO DEI CAVALIERI","NO","C2","C2.1",3600000,30,"stimata","SAN POLO DEI CAVALIERI","NO","Scheda progetto","2019",null,null,null,null,null,7.0000000000000007E-2,null,null,null,null,null,0,null,0,null,0,null,0,null,0,null,50000,null,50000,0]
[null,380,"BONIFICA RETE FOGNARIA COMUNE DI SAN POLO DEI CAVALIERI","NO","C2","C2.1",3600000,50,"stimata","SAN POLO DEI CAVALIERI","NO","Scheda progetto","2017",null,null,null,null,null,7.0000000000000007E-2,null,null,null,null,null,0,null,0,null,0,null,100000,null,0,null,0,null,100000,0]
[null,381,"BONIFICA RETE FOGNARIA COMUNE DI SAN VITO ROMANO ","NO","C2","C2.1",3600000,60,"stimata","SAN VITO ROMANO","NO","Scheda progetto","2016",null,null,null,null,null,7.0000000000000007E-2,null,null,null,null,null,0,null,0,null,130000,null,0,null,0,null,0,null,130000,0]
[null,382,"SISTEMAZIONE IMPIANTI DI SOLLEVAMENTO E RETE FOGNARIA PER COLLEGAMENTO DEFINITIVO DEP. NAVETTA (ELIMINAZIONE)","NO","C2","C2.1",3600000,1500,"rilevata","SANTA MARINELLA","NO","Scheda progetto","2017",null,null,null,null,null,7.0000000000000007E-2,null,0,null,0,null,0,null,0,null,0,null,300000,null,0,null,0,null,300000,0]
[null,383,"SPOSTAMENTO E POTENZIAMENTO SOLLEVAMENTO \"BAIA SMERALDA\"","NO","C2","C2.1",3600000,1500,"rilevata","SANTA MARINELLA","NO","Scheda progetto","2017",null,null,null,null,null,7.0000000000000007E-2,null,0,null,20344.91,null,0,null,0,null,300000,null,363975,null,0,null,0,null,663975,0]
[null,384,"SPOSTAMENTO SOLLEVAMENTO DALL'ALVEO DEL FOSSO \"VALLE SEMPLICE\" CON SISTEMAZIONE DEL COLLETTORE AFFERENTE","NO","C2","C2.1",3600000,110,"stimata","SANTA MARINELLA","NO","Scheda progetto","2016",null,null,null,null,null,7.0000000000000007E-2,null,0,null,0,null,0,null,0,null,250000,null,0,null,0,null,0,null,250000,0]
[null,385,"BONIFICA RETE FOGNARIA COMUNE DI SANTA MARINELLA ","NO","C2","C2.1",3600000,730,"stimata","SANTA MARINELLA","NO","Scheda progetto","2018",null,null,null,null,null,7.0000000000000007E-2,null,null,null,null,null,0,null,0,null,0,null,650000,null,1040000,null,0,null,1690000,0]
[null,386,"BONIFICA RETE FOGNARIA COMUNE DI SANT'ORESTE ","NO","C2","C2.1",3600000,30,"stimata","SANT'ORESTE","NO","Scheda progetto","2019",null,null,null,null,null,7.0000000000000007E-2,null,null,null,null,null,0,null,0,null,0,null,0,null,0,null,50000,null,50000,0]
[null,387,"BONIFICA RETE FOGNARIA COMUNE DI SARACINESCO ","NO","C2","C2.1",3600000,30,"stimata","SARACINESCO","NO","Scheda progetto","2019",null,null,null,null,null,7.0000000000000007E-2,null,null,null,null,null,0,null,0,null,0,null,0,null,0,null,50000,null,50000,0]
[null,388,"BONIFICA RETE FOGNARIA COMUNE DI SEGNI ","NO","C2","C2.1",3600000,50,"stimata","SEGNI","NO","Scheda progetto","2016",null,null,null,null,null,7.0000000000000007E-2,null,null,null,null,null,0,null,0,null,100000,null,0,null,0,null,0,null,100000,0]
[null,389,"BONIFICA RETE FOGNARIA COMUNE DI SUBIACO ","NO","C2","C2.1",3600000,120,"stimata","SUBIACO","NO","Scheda progetto","2018",null,null,null,null,null,7.0000000000000007E-2,null,null,null,null,null,0,null,0,null,0,null,160000,null,110000,null,0,null,270000,0]
[null,390,"BONIFICA RETE FOGNARIA NELLA FRAZIONE BIVIO SAN POLO DI TIVOLI","NO","C2","C2.1",3600000,1000,"stimata","TIVOLI","NO","Scheda progetto","2018",null,null,null,null,null,7.0000000000000007E-2,null,null,null,null,null,0,null,0,null,0,null,500000,null,718750,null,0,null,1218750,0]
[null,391,"BONIFICA RETE FOGNARIA COMUNE DI TIVOLI ","NO","C2","C2.1",3600000,220,"stimata","TIVOLI","NO","Scheda progetto","2018",null,null,null,null,null,7.0000000000000007E-2,null,null,null,null,null,0,null,0,null,0,null,240000,null,260000,null,0,null,500000,0]
[null,392,"BONIFICA RETE FOGNARIA COMUNE DI TOLFA ","NO","C2","C2.1",3600000,30,"stimata","TOLFA","NO","Scheda progetto","2018",null,null,null,null,null,7.0000000000000007E-2,null,null,null,null,null,0,null,0,null,0,null,0,null,50000,null,0,null,50000,0]
[null,393,"BONIFICA RETE FOGNARIA COMUNE DI TORRITA TIBERINA ","NO","C2","C2.1",3600000,30,"stimata","TORRITA TIBERINA","NO","Scheda progetto","2019",null,null,null,null,null,7.0000000000000007E-2,null,null,null,null,null,0,null,0,null,0,null,0,null,0,null,50000,null,50000,0]
[null,394,"BONIFICA RETE FOGNARIA COMUNE DI TREVIGNANO ROMANO ","NO","C2","C2.1",3600000,170,"stimata","TREVIGNANO ROMANO","NO","Scheda progetto","2018",null,null,null,null,null,7.0000000000000007E-2,null,null,null,null,null,0,null,0,null,0,null,120000,null,260000,null,0,null,380000,0]
[null,395,"BONIFICA RETE FOGNARIA COMUNE DI VEJANO","NO","C2","C2.1",3600000,30,"stimata","VEJANO","NO","Scheda progetto","2019",null,null,null,null,null,7.0000000000000007E-2,null,null,null,null,null,0,null,0,null,0,null,0,null,0,null,50000,null,50000,0]
[null,396,"BONIFICA RETE FOGNARIA COMUNE DI VELLETRI","NO","C2","C2.1",3600000,110,"stimata","VELLETRI","NO","Scheda progetto","2018",null,null,null,null,null,7.0000000000000007E-2,null,null,null,null,null,0,null,0,null,0,null,150000,null,90000,null,0,null,240000,0]
[null,397,"MESSA IN SICUREZZA AREA DI FRANA IN VIA ORTI GINETTI","NO","C2","C2.1",3600000,70,"stimata","VELLETRI","NO","Scheda progetto","2016",null,null,null,null,null,7.0000000000000007E-2,null,0,null,0,null,0,null,0,null,150000,null,0,null,0,null,0,null,150000,0]
[null,398,"BONIFICA RETE FOGNARIA COMUNE DI VICOVARO","NO","C2","C2.1",3600000,170,"stimata","VICOVARO","NO","Scheda progetto","2016",null,null,null,null,null,7.0000000000000007E-2,null,null,null,null,null,0,null,0,null,390000,null,0,null,0,null,0,null,390000,0]
[null,399,"BONIFICA RETE FOGNARIA COMUNE DI ZAGAROLO","NO","C2","C2.1",3600000,30,"stimata","ZAGAROLO","NO","Scheda progetto","2017",null,null,null,null,null,7.0000000000000007E-2,null,null,null,null,null,0,null,0,null,0,null,70000,null,0,null,0,null,70000,0]
[null,400,"ELIMINAZIONE SNAN ARIF01 VIA DELLE CESE NETTUNENSE","SI","D1","D1.1",69243,70,"stimata","ARICCIA","NO","Progetto esecutivo","2016",null,null,null,null,null,18813,null,14861.7,null,22663.32,null,0,null,0,null,45500,null,0,null,0,null,0,null,45500,0]
[null,401,"AMPLIAMENTO IMPIANTO DEPURAZIONE VALLE PISCIANA","SI","D1","D1.1",2236900,16000,"rilevata","ARTENA","NO","Progetto definitivo","OLTRE 2019",null,null,null,null,null,25,null,9288.85,null,2582.17,null,130000,null,1950000,null,0,null,0,null,1500000,null,1500000,null,3000000,0]
[null,402,"IMPIANTO DI DEPURAZIONE NEL COMUNE DI CARPINETO ROMANO","SI","D1","D1.1",69243,4550,"rilevata","CARPINETO ROMANO","SI","Lavori in corso","2016",null,null,null,null,null,18813,null,2562.02,null,842099.9,null,1079616.5250000001,null,0,null,2522616.5249999999,null,0,null,0,null,0,null,2522616.5249999999,0]
[null,403,"POTENZIAMENTO DELL'IMPIANTO DI DEPURAZIONE “COLLE VERDE”","NO","D1","D1.1",2236900,500,"stimata","CASTELNUOVO DI PORTO","NO","Scheda progetto","2016",null,null,null,null,null,25,null,0,null,9.39,null,0,null,0,null,150000,null,0,null,0,null,0,null,150000,0]
[null,404,"ELIMINAZIONE SNAN CAV F04","SI","D1","D1.1",69243,70,"stimata","CAVE","NO","Progetto esecutivo","2016",null,null,null,null,null,18813,null,33.590000000000003,null,41840.22,null,0,null,0,null,234000,null,0,null,0,null,0,null,234000,0]
[null,405,"REALIZZAZIONE DI UN IMPIANTO DI DEPURAZIONE NELLA FRAZIONE DI CERI","SI","D1","D1.1",69243,98,"rilevata","CERVETERI","NO","Lavori in corso","2017",null,null,null,null,null,18813,null,20343.43,null,16613.580000000002,null,0,null,1147575,null,1000000,null,147575,null,0,null,0,null,1147575,0]
[null,406,"POTENZIAMENTO DEPURATORE VALCANNETO","NO","D1","D1.1",2236900,7000,"rilevata","CERVETERI","NO","Scheda progetto","2018",null,null,null,null,null,25,null,0,null,555.11,null,0,null,0,null,0,null,731250,null,731250,null,0,null,1462500,0]
[null,407,"ELIMINAZIONE DELLO SCARICO SUL FOSSO DELLA MARANELLA – COMUNE DI CIAMPINO","SI","D1","D1.1",69243,290,"rilevata","CIAMPINO","SI","Progetto esecutivo","2016",null,null,null,null,null,18813,null,12780.85,null,14702.61,null,722832.5,null,0,null,788823,null,0,null,0,null,0,null,788823,0]
[null,408,"POTENZIAMENTO DEPURATORE PRATO LA CORTE","SI","D1","D1.1",2236900,10000,"rilevata","FORMELLO","NO","Scheda progetto","OLTRE 2019",null,null,null,null,null,25,null,361.68,null,644.04,null,2301000,null,1404000,null,0,null,0,null,1000000,null,1500000,null,2500000,0]
[null,409,"ELIMINAZIONE SCARICO F2 NEL COMUNE DI FRASCATI","SI","D1","D1.1",69243,1780,"rilevata","FRASCATI","SI","Lavori in corso","2016",null,null,null,null,null,18813,null,1092459,null,1807323,null,0,null,0,null,143095,null,0,null,0,null,0,null,143095,0]
[null,410,"RISANAMENTO IGIENICO-SANITARIO LOC. COCCIANO (ELIM. SNAN FRAF04 FRAF06 E FRAF07)","SI","D1","D1.1",69243,2590,"rilevata","FRASCATI","SI","Lavori in corso","2016",null,null,null,null,null,18813,null,1509244,null,1293763,null,0,null,0,null,130661,null,0,null,0,null,0,null,130661,0]
[null,411,"POTENZIAMENTO IMPIANTO DEL COMUNE DI GENAZZANO","NO","D1","D1.1",2236900,8000,"rilevata","GENAZZANO","NO","Progetto definitivo","OLTRE 2019",null,null,null,null,null,25,null,227.14,null,1022.62,null,0,null,0,null,0,null,0,null,1000000,null,1000000,null,2000000,0]
[null,412,"COLLETTORE ALBUCCIONE - PIP. TAVERNELLE (ELIM. SNAN GUIF4,GUIF05 ,GUIF16,GUIF17 E GUIF18)","SI","D1","D1.1",69243,1185,"stimata","GUIDONIA MONTECELIO","SI","Lavori in corso","2018",null,null,null,null,null,18813,null,88285.21,null,22007.43,null,1258079.9399999997,null,0,null,1500000,null,1690000.0000000002,null,980503.92200000025,null,0,null,4170503.9220000003,0]
[null,413,"COLL.LA BOTTE-LOTTI MONNARESI-V.GARIBALDI (GUIDONIA,ELIMINAZ.SC.F11EF10) E CAMPO LIMPIDO (TIVOLI)","SI","D1","D1.1",69243,1330,"rilevata","GUIDONIA MONTECELIO","SI","Lavori in corso","2017",null,null,null,null,null,18813,null,41913.21,null,301536,null,0,null,0,null,2220864.3435789472,null,1295504.2004210525,null,0,null,0,null,3516368.5439999998,0]
[null,414,"Eliminazione dello SNAN GUIF24","NO","D1","D1.1",69243,null,null,"GUIDONIA MONTECELIO","SI","Progetto definitivo","2016",null,null,null,null,null,18813,null,0,null,0,null,0,null,0,null,195000,null,0,null,0,null,0,null,195000,0]
[null,415,"Rete fognaria su Via Poggio Ameno - Eliminazione GUIF19","SI","D1","D1.1",69243,210,"stimata","GUIDONIA MONTECELIO","SI","Lavori in corso","2016",null,null,null,null,null,18813,null,586625.9,null,5034.53,null,0,null,0,null,410000,null,0,null,0,null,0,null,410000,0]
[null,416,"AMPLIAMENTO DEPURATORE CAR - SETTEVILLE ","SI","D1","D1.1",2236900,15000,"rilevata","GUIDONIA MONTECELIO","NO","Progetto preliminare","2018",null,null,null,null,null,25,null,361.68,null,52981.86,null,0,null,1300000,null,0,null,1300000,null,1610375,null,0,null,2910375,0]
[null,417,"AMPLIAMENTO DEPURATORE PONTE LUCANO DI GUIDONIA MONTECELIO","SI","D1","D1.1",2236900,85000,"rilevata","GUIDONIA MONTECELIO","NO","Progetto definitivo","OLTRE 2019",null,null,null,null,null,25,null,908.42,null,67896.56,null,390000,null,2600000,null,0,null,0,null,0,null,1000000,null,1000000,0]
[null,418,"COMPLETAMENTO DEPURATORE COSTA DEL FIUME E SISTEMAZIONE STRADA DI ACCESSO","NO","D1","D1.1",69243,340,"stimata","JENNE ","NO","Progetto definitivo","2017",null,null,null,null,null,18813,null,null,null,null,null,0,null,0,null,417007.5,null,417007.5,null,0,null,0,null,834015,0]
[null,419,"POTENZIAMENTO E ADEGUAMENTO IMPIANTO DI DEPURAZIONE LA PIETRARA CON SISTEMA MBR","SI","D1","D1.1",2236900,9000,"rilevata","LANUVIO","NO","Progetto definitivo","2018",null,null,null,null,null,25,null,null,null,null,null,1300000,null,1143545,null,0,null,1500000,null,943545,null,0,null,2443545,0]
[null,420,"ADEGUAMENTO E POTENZIAMENTO IMPIANTO DI DEPURAZIONE \"VALLE MAZZONE\"","SI","D1","D1.1",2236900,9000,"rilevata","LARIANO","SI","Lavori in corso","2017",null,null,null,null,null,25,null,1148.8,null,583657.69999999995,null,1103017.747,null,0,null,3000000,null,1743017.7470000004,null,0,null,0,null,4743017.7470000004,0]
[null,421,"AMPLIAMENTO DEPURATORE SANTA MARIA DELLE MOLE","SI","D1","D1.1",2236900,50000,"rilevata","MARINO","NO","Progetto preliminare","OLTRE 2019",null,null,null,null,null,25,null,361.68,null,134697.29999999999,null,0,null,390000,null,0,null,0,null,1500000,null,1500000,null,3000000,0]
[null,422,"RISANAM.IGIENICO-SANIT. - I° LOTTO IMPIANTO DI DEPURAZIONE","SI","D1","D1.1",2236900,30000,"rilevata","MENTANA","SI","Lavori in corso","2018",null,null,null,null,null,18813,null,19469.490000000002,null,815097.1,null,2600000,null,2600000,null,3000000,null,3000000,null,2217665.7420000006,null,0,null,8217665.7420000006,0]
[null,423,"RISANAM. IGIENICO-SANIT. - II LOTTO COLLETTORI","SI","D1","D1.1",69243,7150,"stimata","MENTANA","SI","Lavori in corso","2016",null,null,null,null,null,18813,null,97214.21,null,3539966,null,1950000,null,2468948.5859999997,null,2780948.5859999997,null,0,null,0,null,0,null,2780948.5859999997,0]
[null,424,"Collegamento fognario su Via S. Domenico  (elimin. SNAN MONF09)","SI","D1","D1.1",69243,122,"stimata","MONTEROTONDO","SI","Lavori in corso","2017",null,null,null,null,null,18813,null,0,null,2011.49,null,0,null,0,null,0,null,39000,null,0,null,0,null,39000,0]
[null,425,"ELIMINAZIONE SNAN OLEF02 IN VIA DI S.P. VIA DI S. MARTINO ","SI","D1","D1.1",69243,null,null,"OLEVANO ROMANO","NO","Scheda progetto","2016",null,null,null,null,null,18813,null,null,null,null,null,0,null,0,null,130000,null,0,null,0,null,0,null,130000,0]
[null,426,"ELIMINAZIONE SNAN OLEF04 BONIFICA IN VIA SELVA DI SOTTO ","SI","D1","D1.1",69243,null,null,"OLEVANO ROMANO","NO","Scheda progetto","2016",null,null,null,null,null,18813,null,0,null,0,null,0,null,0,null,169000,null,0,null,0,null,0,null,169000,0]
[null,427,"REALIZZAZIONE TRATTAMENTO BOTTINI IMPIANTO DI DEPURAZIONE OLEVANO SUD","NO","D1","D1.1",2236900,6700,"rilevata","OLEVANO ROMANO","NO","Scheda progetto","2017",null,null,null,null,null,25,null,null,null,null,null,0,null,0,null,0,null,341250,null,0,null,0,null,341250,0]
[null,428,"Località Ponte Sodo - Eliminazione SNAN RIAF02","SI","D1","D1.1",69243,null,null,"RIANO ","SI","Progetto esecutivo","2018",null,null,null,null,null,18813,null,0,null,889.98,null,0,null,0,null,0,null,300000,null,336000,null,0,null,636000,0]
[null,429,"AMPLIAMENTO DEPURATORE PIANA PERINA","SI","D1","D1.1",2236900,24000,"stimata","RIANO ","NO","Lavori in corso","OLTRE 2019",null,null,null,null,null,25,null,27230.57,null,15463.57,null,2210000,null,227500,null,0,null,0,null,0,null,2000000,null,2000000,0]
[null,430,"MAGLIANELLA VI TRONCO BY-PASS DEP.PALMAROLA (ELIM. SCARICO F51) - PROC. DI INFRAZIONE 2014/2059","SI","D1","D1.1",69243,1530,"rilevata","Roma_13-ex18","NO","Progetto definitivo","OLTRE 2019",null,null,null,null,null,18813,null,49593.51,null,3237.11,null,3250000,null,5200000,null,0,null,1000000,null,3000000,null,3000000,null,7000000,0]
[null,431,"COMPLETAMENTO COLLETTORE CAMPANELLE (ELIMINAZIONE SCARICO F57A) - PROC. DI INFRAZIONE 2014/2059","SI","D1","D1.1",69243,1077,"rilevata","Roma_14-ex19","SI","Lavori in corso","2016",null,null,null,null,null,18813,null,1517418,null,464882.4,null,0,null,0,null,139903.6859999999,null,0,null,0,null,0,null,139903.6859999999,0]
[null,432,"ELIMINAZIONE SCARICO F19 - VIA VEIENTANA (COLLEG. CRESCENZA II LOTTO) - PROC. DI INFRAZIONE 2014/2059","SI","D1","D1.1",69243,1650,"rilevata","Roma_15-ex20","NO","Progetto definitivo","2017",null,null,null,null,null,18813,null,1078.27,null,1166.82,null,3873700.5352500002,null,0,null,900000,null,2973700.5352500002,null,0,null,0,null,3873700.5352500002,0]
[null,433,"ELIMINAZIONE SCARICO F14 - VIA FLAMINIA VECCHIA - PROC. DI INFRAZIONE 2014/2059","SI","D1","D1.1",69243,70,"rilevata","Roma_15-ex20","SI","Lavori in corso","2016",null,null,null,null,null,18813,null,11788.73,null,63121,null,0,null,0,null,632840.74100000004,null,0,null,0,null,0,null,632840.74100000004,0]
[null,434,"COLLETTORE DI ISOLA FARNESE CRESCENZA III LOTTO (ELIMINAZIONE SCARICHI F77,F81 E BY-PASS DEPURATORE GIUSTINIANELLA) - PROC. DI INFRAZIONE 2014/2059","SI","D1","D1.1",69243,11400,"rilevata","Roma_15-ex20","NO","Progetto definitivo","OLTRE 2019",null,null,null,null,null,18813,null,438752.1,null,497119,null,1300000,null,5200000,null,0,null,2000000,null,3000000,null,3000000,null,8000000,0]
[null,435,"ELIMINAZIONE SCARICHI  F13 E F20  - COLLETTORE ACQUA TRAVERSA VI LOTTO - PROC. DI INFRAZIONE 2014/2059","NO","D1","D1.1",69243,3013,"rilevata","Roma_15-ex20","SI","Progetto definitivo","2018",null,null,null,null,null,18813,null,null,null,null,null,0,null,0,null,1000000,null,2500000,null,1960000,null,0,null,5460000,0]
[null,436,"IMPIANTO DI DEPURAZIONE ROMA NORD - POTENZIAMENTO E ADEGUAMENTO DELLA LINEA LIQUAMI","SI","D1","D1.1",2236900,780000,"stimata","Roma_15-ex20","NO","Progetto definitivo","OLTRE 2019",null,null,null,null,null,25,null,466.13,null,393.52,null,0,null,3900000,null,0,null,0,null,3000000,null,3000000,null,6000000,0]
[null,437,"ELIMINAZIONE SCARICO F23 AL COLLETTORE DI REBIBBIA - PROC. DI INFRAZIONE 2014/2059","SI","D1","D1.1",69243,1915,"rilevata","Roma_4-ex5","NO","Progetto definitivo","2017",null,null,null,null,null,18813,null,3107.9,null,2943.14,null,650000,null,1148875,null,1000000,null,798875,null,0,null,0,null,1798875,0]
[null,438,"POTENZIAMENTO DELL'IMPIANTO DI DEPURAZIONE DI SETTECAMINI - FASE B","NO","D1","D1.1",2236900,14000,"rilevata","Roma_4-ex5","NO","Progetto definitivo","OLTRE 2019",null,null,null,null,null,25,null,263157.3,null,530138.1,null,0,null,0,null,0,null,0,null,1500000,null,1500000,null,3000000,0]
[null,439,"COLLETTORE IV MIGLIO - ALMONE (ELIMINAZIONE SCARICO C04) - PROC. DI INFRAZIONE 2014/2059","SI","D1","D1.1",69243,16860,"rilevata","Roma_7-ex9ex10","SI","Lavori in corso","2016",null,null,null,null,null,18813,null,871490.6,null,934374.40000000002,null,0,null,0,null,357942.4810000002,null,0,null,0,null,0,null,357942.4810000002,0]
[null,440,"PONTE LADRONE II LOTTO (ELIMINAZIONE SCARICHI C06 E F65) - PROC. DI INFRAZIONE 2014/2059","SI","D1","D1.1",69243,5883,"rilevata","Roma_9-ex12","NO","Progetto definitivo","OLTRE 2019",null,null,null,null,null,18813,null,141191.1,null,3083.02,null,3900000,null,5200000,null,0,null,2000000,null,3000000,null,3000000,null,8000000,0]
[null,441,"NUOVO COMPARTO DI DISIDRATAZIONE MECCANICA DEI FANGHI - IMPIANTO DI DEPURAZIONE ROMA SUD","SI","D1","D1.1",2236900,1100000,"stimata","Roma_9-ex12","NO","Progetto definitivo","2018",null,null,null,null,null,25,null,205906.1,null,1894.87,null,1950000,null,3698500,null,500000,null,2000000,null,3296375,null,0,null,5796375,0]
[null,442,"DEPURATORE ROMA SUD - POTENZIAMENTO DEI PRETRATTAMENTI","SI","D1","D1.1",2236900,1100000,"stimata","Roma_9-ex12","SI","Lavori in corso","2017",null,null,null,null,null,25,null,521109,null,3849219,null,2036206.952,null,0,null,3400000,null,2710816,null,0,null,0,null,6110816,0]
[null,443,"NUOVA LINEA DEP ROMA SUD","NO","D1","D1.1",2236900,1100000,"stimata","RomaSud","NO","Scheda progetto","OLTRE 2019",null,null,null,null,null,25,null,0,null,0,null,0,null,0,null,0,null,0,null,0,null,2000000,null,2000000,0]
[null,444,"RISANAMENTO SNAN SVRF02","NO","D1","D1.1",69243,null,null,"SAN VITO ROMANO","SI","Lavori in corso","2016",null,null,null,null,null,18813,null,0,null,1976.43,null,0,null,0,null,26000,null,0,null,0,null,0,null,26000,0]
[null,445,"RIPRISTINO FUNIZIONALITA' DEPURATORE SARACINESCO","NO","D1","D1.1",2236900,200,"stimata","SARACINESCO","NO","Scheda progetto","2017",null,null,null,null,null,25,null,0,null,0,null,0,null,0,null,0,null,500000,null,0,null,0,null,500000,0]
[null,446,"POTENZIAMENTO DEL DEPURATORE DI VALLE MACERINA","SI","D1","D1.1",2236900,20000,"rilevata","SEGNI","NO","Progetto definitivo","OLTRE 2019",null,null,null,null,null,25,null,361.68,null,87123.16,null,2600000,null,1300000,null,0,null,500000,null,1300000,null,1300000,null,3100000,0]
[null,447,"NUOVO IMPIANTO DEPURAZIONE POLVERIERA","SI","D1","D1.1",69243,null,null,"TIVOLI","NO","Scheda progetto","OLTRE 2019",null,null,null,null,null,18813,null,361.68,null,174,null,0,null,390000,null,0,null,0,null,0,null,1000000,null,1000000,0]
[null,448,"RISANAMENTO IG.-SANITARIO BACINO S. GIOVANNI (ELIM. SNAN F4)","SI","D1","D1.1",69243,180,"rilevata","TIVOLI","SI","Lavori in corso","2017",null,null,null,null,null,18813,null,21625.37,null,65596.87,null,1098500,null,0,null,1186986,null,260362,null,0,null,0,null,1447348,0]
[null,449,"AMPLIAMENTO IMPIANTO DI DEPURAZIONE COMUNALE LOCALITÀ PRATI SANT'ORSIO","SI","D1","D1.1",2236900,2500,"rilevata","VEJANO","NO","Scheda progetto","2017",null,null,null,null,null,25,null,908.42,null,29301.3,null,390000,null,1355250,null,500000,null,1245250,null,0,null,0,null,1745250,0]
[null,450,"ELIMINAZIONE SNAN F1,F2,F3,F4,F5,F6,F7,F8,F9, F12 NEL COMUNE DI VELLETRI","SI","D1","D1.1",69243,7450,"rilevata","VELLETRI","SI","Lavori in corso","2016",null,null,null,null,null,18813,null,644360.9,null,1046163,null,0,null,0,null,1765688,null,0,null,0,null,0,null,1765688,0]
[null,451,"ADEGUAMENTO IMPIANTO DI DEPURAZIONE LA CHIUSA - VELLETRI","SI","D1","D1.1",2236900,40000,"rilevata","VELLETRI","SI","Progetto definitivo","2017",null,null,null,null,null,25,null,43742.02,null,769.21,null,0,null,1300000,null,1000000,null,2490500,null,0,null,0,null,3490500,0]
[null,452,"Eliminazione dello SNAN VICF01","SI","D1","D1.1",69243,210,"rilevata","VICOVARO","SI","Progetto definitivo","2016",null,null,null,null,null,18813,null,6581.72,null,18716.7,null,0,null,0,null,128500,null,0,null,0,null,0,null,128500,0]
[null,453,"AMPLIAMENTO IMPIANTO DI DEPURAZIONE VALLE GIORDANO E COLLETTORE STAZIONE","SI","D1","D1.1",2236900,10000,"rilevata","ZAGAROLO","NO","Progetto definitivo","2018",null,null,null,null,null,25,null,148474.9,null,5165.6499999999996,null,2600000,null,3900000,null,3000000,null,3300000,null,2325825,null,0,null,8625825,0]
[null,454,"ADEGUAMENTO DEPURATORE BOLZELLA","SI","D2",null,3600000,4500,"rilevata","ALLUMIERE","NO","Scheda progetto","2019",null,null,null,null,null,0,null,361.68,null,12441.95,null,0,null,2550112.5,null,0,null,0,null,1500000,null,1050112,null,2550112,0]
[null,455,"IMPIANTO DI DEPURAZIONE DI FREGENE - RISTRUTTURAZIONE, RINNOVO ED ADEGUAMENTO DELL'IMPIANTO","SI","D2",null,3600000,80000,"rilevata","FIUMICINO","SI","Lavori in corso","2016",null,null,null,null,null,0,null,2556352,null,2770585,null,1335501.3100000015,null,0,null,3072697.0950000002,null,0,null,0,null,0,null,3072697.0950000002,0]
[null,456,"RILANCIO DELLE ACQUE DEPURATE PRESSO L'IMPIANTO DI PRATO LA CORTE AL FOSSO DELLA VALCHETTA","SI","D2",null,3600000,10000,"rilevata","FORMELLO","NO","Scheda progetto","2017",null,null,null,null,null,0,null,361.68,null,267.14999999999998,null,616319.6,null,0,null,0,null,746320,null,0,null,0,null,746320,0]
[null,457,"PROLUNGAMENTO DELLO SCARICO E ADEGUAMENTO DEPURATORE \"SASSO\"","NO","D2",null,3600000,200,"stimata","località sasso cerveteri","NO","Scheda progetto","2017",null,null,null,null,null,0,null,0,null,0,null,0,null,0,null,0,null,500000,null,0,null,0,null,500000,0]
[null,458,"ADEDUAMENTO FONTE TONELLO","NO","D2",null,3600000,2500,"rilevata","MARCELLINA","NO","Scheda progetto","2017",null,null,null,null,null,0,null,0,null,0,null,0,null,0,null,0,null,1000000,null,0,null,0,null,1000000,0]
[null,459,"MANUTENZIONE IMPIANTI","NO","D2",null,3600000,1030277,"stimata","OLTRE ROMA","NO","Scheda progetto","2019",null,null,null,null,null,0,null,0,null,0,null,0,null,0,null,4000000,null,4000000,null,4000000,null,4000000,null,16000000,0]
[null,460,"ADEGUAMENTO DELL'IMPIANTO DI DEPURAZIONE RIO PEPE E COLLETTORE QUADRELLE","NO","D2",null,3600000,8000,"rilevata","PALESTRINA ","NO","Progetto definitivo","OLTRE 2019",null,null,null,null,null,0,null,546.75,null,0,null,0,null,0,null,0,null,0,null,2500000,null,2000000,null,4500000,0]
[null,461,"INTERVENTI DI RIPRISTINO FUNZIONALITÀ IMPIANTO PRATICA DI MARE NEL COMUNE DI POMEZIA","NO","D2",null,3600000,60000,"stimata","POMEZIA ","NO","Progetto preliminare","2018",null,null,null,null,null,0,null,null,null,null,null,0,null,0,null,0,null,0,null,1267500,null,0,null,1267500,0]
[null,462,"RIPRISTINO SCARICO A MARE DEPURATORE PRATICA","NO","D2",null,3600000,60000,"stimata","POMEZIA ","NO","Progetto preliminare","OLTRE 2019",null,null,null,null,null,0,null,0,null,0,null,0,null,0,null,0,null,0,null,2200250.0000000005,null,2200250.0000000005,null,4400500.0000000009,0]
[null,463,"INTERVENTI DI RIPRISTINO FUNZIONALITÀ IMPIANTO CROCETTA NEL COMUNE DI POMEZIA","NO","D2",null,3600000,90000,"rilevata","POMEZIA ","NO","Progetto preliminare","2018",null,null,null,null,null,0,null,null,null,null,null,0,null,0,null,0,null,0,null,1267500,null,0,null,1267500,0]
[null,464,"RIPRISTINO SCARICO A MARE DEPURATORE CROCETTA","NO","D2",null,3600000,90000,"rilevata","POMEZIA ","NO","Progetto preliminare","OLTRE 2019",null,null,null,null,null,0,null,0,null,0,null,0,null,0,null,0,null,0,null,2500000,null,2000000,null,4500000,0]
[null,465,"MANUTENZIONE IMPIANTI","NO","D2",null,3600000,2600000,"stimata","ROMA","NO","Scheda progetto","2019",null,null,null,null,null,0,null,null,null,null,null,0,null,0,null,2500000,null,2500000,null,2500000,null,2500000,null,10000000,0]
[null,466,"MANUTENZIONE ROMA EST","NO","D2",null,3600000,900000,"rilevata","ROMA","NO","Scheda progetto","2019",null,null,null,null,null,0,null,null,null,null,null,0,null,0,null,1500000,null,1500000,null,1500000,null,1500000,null,6000000,0]
[null,467,"MANUTENZIONE ROMA NORD","NO","D2",null,3600000,780000,"rilevata","ROMA","NO","Scheda progetto","2019",null,null,null,null,null,0,null,null,null,null,null,0,null,0,null,1500000,null,1500000,null,1500000,null,1500000,null,6000000,0]
[null,468,"MANUTENZIONE ROMA SUD","NO","D2",null,3600000,1100000,"rilevata","ROMA","NO","Scheda progetto","2019",null,null,null,null,null,0,null,null,null,null,null,0,null,0,null,3000000,null,3000000,null,3000000,null,3000000,null,12000000,0]
[null,469,"MANUTENZIONE ROMA OSTIA","NO","D2",null,3600000,350000,"rilevata","ROMA","NO","Scheda progetto","2019",null,null,null,null,null,0,null,null,null,null,null,0,null,0,null,600000,null,600000,null,600000,null,600000,null,2400000,0]
[null,470,"ADEGUAMENTO IMPIANTO DI CASAL MONASTERO","NO","D2",null,3600000,9000,"stimata","Roma_4-ex5","NO","Progetto definitivo","2018",null,null,null,null,null,0,null,null,null,null,null,0,null,0,null,0,null,0,null,975000,null,0,null,975000,0]
[null,471,"DEPURATORE DI ROMA SUD: IMPIANTO DI TRATTAMENTO DELLE ACQUE DI LAVAGGIO DELLA BIOFILTRAZIONE","SI","D2",null,3600000,1100000,"stimata","Roma_9-ex12","SI","Lavori in corso","2016",null,null,null,null,null,0,null,4093426,null,1265163,null,580075.6,null,0,null,344321.60099999828,null,0,null,0,null,0,null,344321.60099999828,0]
[null,472,"IMPIANTO DEPURAZIONE ROMA SUD - ADEGUAMENTO SEDIMENTAZIONE SECONDARIA","SI","D2",null,3600000,1100000,"stimata","Roma_9-ex12","NO","Scheda progetto","OLTRE 2019",null,null,null,null,null,0,null,0,null,312.87,null,780000,null,1170000,null,0,null,0,null,0,null,780000,null,780000,0]
[null,473,"IMPIANTO DI DEPURAZIONE ROMA SUD - NUOVO IMPIANTO DI SCARICO DELL'EFFLUENTE FINALE","SI","D2",null,3600000,1100000,"stimata","Roma_9-ex12","NO","Progetto definitivo","2018",null,null,null,null,null,0,null,37843.14,null,60735.72,null,2600000,null,1556100,null,500000,null,2600000,null,1186100,null,0,null,4286100,0]
[null,474,"REVAMPING BIOFILTRAZIONE II - STEREAU E NUOVA CABINA ARIA ROMA SUD","NO","D2",null,3600000,1100000,"stimata","Roma_9-ex12","NO","Scheda progetto","OLTRE 2019",null,null,null,null,null,0,null,0,null,0,null,0,null,0,null,0,null,0,null,0,null,2500000,null,2500000,0]
[null,475,"REVAMPING BIOFILTRAZIONE I - OTV E NUOVA CABINA ARIA ROMA SUD","NO","D2",null,3600000,1100000,"stimata","Roma_9-ex12","NO","Scheda progetto","OLTRE 2019",null,null,null,null,null,0,null,64066.12,null,667.15,null,0,null,0,null,0,null,0,null,0,null,2500000,null,2500000,0]
[null,476,"ROMA SUD - PROGETTAZIONE NUOVO SISTEMA DI AERAZIONE ","NO","D2",null,3600000,1100000,"stimata","RomaSud","NO","Scheda progetto","OLTRE 2019",null,null,null,null,null,0,null,0,null,0,null,0,null,0,null,0,null,0,null,0,null,2000000,null,2000000,0]
[null,477,"ADEGUAMENTO IMPIANTO DI DEPURAZIONE ACQUA GRICCIA ","SI","D2",null,3600000,5000,"rilevata","SACROFANO","NO","Scheda progetto","OLTRE 2019",null,null,null,null,null,0,null,39360.660000000003,null,523.97,null,1040000,null,1495000,null,0,null,0,null,1000000,null,1000000,null,2000000,0]
[null,478,"ADEGUAMENTO DEPURATORE LA VETRICE","NO","D2",null,3600000,5000,"rilevata","SAN CESAREO","NO","Progetto preliminare","2018",null,null,null,null,null,0,null,0,null,0,null,0,null,0,null,0,null,0,null,2061540,null,0,null,2061540,0]
[null,479,"ADEGUAMENTO DELL’IMPIANTO DI DEPURAZIONE SANTA MARINELLA NORD E SUD - INTERVENTI URGENTI","SI","D2",null,3600000,17000,"rilevata","SANTA MARINELLA","SI","Lavori in corso","OLTRE 2019",null,null,null,null,null,0,null,0,null,1155.6500000000001,null,0,null,0,null,1335964.73,null,0,null,0,null,0,null,1335964.73,0]
[null,480,"ADEGUAMENTO IMPIANTO DEPURAZIONE DI PONTE LUCANO DI TIVOLI E COLLETTORE AFFERENTE","SI","D2",null,3600000,29000,"stimata","TIVOLI","NO","Progetto definitivo","OLTRE 2019",null,null,null,null,null,0,null,361.68,null,846.7,null,0,null,838500,null,0,null,0,null,0,null,1500000,null,1500000,0]
[null,481,"DISMISSIONE DEPURATORI MONTE POZZOLANA E VALLE LINDA","SI","D2","D2.4",172550,3500,"rilevata","CASTELNUOVO DI PORTO","NO","Progetto preliminare","OLTRE 2019",null,null,null,null,null,0,null,361.68,null,751.04,null,2340000,null,1537325.8679999998,null,0,null,0,null,1000000,null,1500000,null,2500000,0]
[null,482,"COLLETTORE FOGNARIO DI ARANOVA","NO","D2","D2.4",172550,5600,"rilevata","FIUMICINO","NO","Scheda progetto","OLTRE 2019",null,null,null,null,null,0,null,0,null,0,null,0,null,0,null,0,null,0,null,0,null,500000,null,500000,0]
[null,483,"RISANAMENTO SANITARIO DI MONTECOMPATRI E ROMA","NO","D2","D2.4",172550,40000,"rilevata","INTERCOMUNALE","NO","Progetto preliminare","OLTRE 2019",null,null,null,null,null,0,null,130860.5,null,0,null,0,null,0,null,0,null,0,null,0,null,1000000,null,1000000,0]
[null,484,"COLLETTORE INTERCOMUNALE PER LA RACCOLTA DELLE ACQUE REFLUE E RELATIVO IMPIANTO DI DEPURAZIONE NEI TERRITORI DI CARPINETO ROMANO, GAVIGNANO, MONTELACINO - I LOTTO","SI","D2","D2.4",172550,6000,"rilevata","INTERCOMUNALE","NO","Progetto esecutivo","OLTRE 2019",null,null,null,null,null,0,null,472466.6,null,42008.1,null,3900000,null,4550000,null,0,null,0,null,0,null,1500000,null,1500000,0]
[null,485,"ELIM. DEP.COLLE PISANO E SONNINO - MONTE PORZIO CATONE II° STRALCIO ELIMINAZIONE DEPURATORE SONNINO","SI","D2","D2.4",172550,5000,"rilevata","MONTE PORZIO CATONE","SI","Progetto esecutivo","2017",null,null,null,null,null,0,null,89371.4,null,6347.2,null,1394250,null,0,null,719875,null,674375,null,0,null,0,null,1394250,0]
[null,486,"ELIM. DEP.COLLE PISANO E SONNINO - MONTE PORZIO CATONE I° STRALCIO ELIM. DEPURATORE COLLE PISANO","SI","D2","D2.4",172550,9600,"rilevata","MONTE PORZIO CATONE","SI","Lavori in corso","2016",null,null,null,null,null,0,null,19668.2,null,607624.80000000005,null,0,null,0,null,774538.90799999994,null,0,null,0,null,0,null,774538.90799999994,0]
[null,487,"DISMISSIONE DEPURATORI PONTE SODO E MONTELUNGO","NO","D2","D2.4",172550,1000,"rilevata","RIANO ","NO","Lavori in corso","2018",null,null,null,null,null,0,null,3881.08,null,17256.169999999998,null,0,null,0,null,0,null,1051892.4000000001,null,1051892.4000000001,null,0,null,2103784.8000000003,0]
[null,488,"ADEGUAMENTO IMPIANTO FOSSO CIPPONE ED ELIMINAZIONE FOSSO IANNI","SI","D2","D2.4",172550,4000,"rilevata","ROIATE","NO","Progetto definitivo","2017",null,null,null,null,null,0,null,361.68,null,2511.8000000000002,null,2502815.25,null,0,null,600000,null,1972903.125,null,0,null,0,null,2572903.125,0]
[null,489,"ELIMINAZIONE DEPURATORE PONTE DI NONA","SI","D2","D2.4",172550,1000,"stimata","ROMA","SI","Lavori in corso","2016",null,null,null,null,null,0,null,622.67999999999995,null,4727.08,null,468000,null,0,null,468000,null,0,null,0,null,0,null,{"$f":"SUM(AC498+AE498+AG498+AI498)","v":468000},0]
[null,490,"ELIMINAZIONE DEPURATORE NUOVA PALOCCO","NO","D2","D2.4",172550,1400,"stimata","Roma_10-ex13","NO","Progetto definitivo","2018",null,null,null,null,null,0,null,0,null,0,null,0,null,0,null,0,null,0,null,1450215,null,0,null,1450215,0]
[null,491,"ELIMINAZIONE DELL’IMPIANTO DI DEPURAZIONE CASE ROSSE DEL COMUNE DI ROMA","SI","D2","D2.4",172550,10500,"stimata","Roma_4-ex5","NO","Progetto definitivo","2018",null,null,null,null,null,0,null,90389.94,null,25285.88,null,0,null,595237.5,null,0,null,0,null,954037.5,null,0,null,954037.5,0]
[null,492,"ELIMINAZIONE DEPURATORE PARCO DELLA TIBURTINA","SI","D2","D2.4",172550,900,"stimata","Roma_4-ex5","NO","Progetto definitivo","2017",null,null,null,null,null,0,null,34043.47,null,18695.52,null,520000,null,0,null,0,null,482625,null,0,null,0,null,482625,0]
[null,493,"ELIMINAZIONE DEPURATORE FINOCCHIO E COLLETTAMENTO A ROMA EST ","SI","D2","D2.4",172550,40000,"stimata","Roma_6-ex8","NO","Progetto definitivo","OLTRE 2019",null,null,null,null,null,0,null,124856.8,null,82899.83,null,951632.5,null,0,null,0,null,0,null,1000000,null,1000000,null,2000000,0]
[null,494,"ELIMINAZIONE DEL DEPURATORE \"GUADO TUFO\"","NO","D2","D2.4",172550,300,"rilevata","SACROFANO","NO","Scheda progetto","OLTRE 2019",null,null,null,null,null,0,null,0,null,0,null,0,null,0,null,0,null,0,null,0,null,500000,null,500000,0]
[null,495,"ELIMINAZIONE DEPURATORE FONTANE NUOVE ","NO","D2","D2.4",172550,650,"stimata","SANT'ORESTE","NO","Scheda progetto","OLTRE 2019",null,null,null,null,null,0,null,0,null,0,null,0,null,0,null,0,null,0,null,0,null,1000000,null,1000000,0]
[null,496,"COLLETTORE FOGNARIO BIVIO SAN POLO - POLVERIERA","SI","D2","D2.4",172550,1200,"rilevata","TIVOLI","NO","Progetto definitivo","2019",null,null,null,null,null,0,null,361.68,null,0,null,0,null,390000,null,0,null,0,null,2000000,null,663017.5,null,2663017.5,0]
[null,497,"COLLETTORE FOGNARIO CAPANNELLE - PONTE LUCANO DI TIVOLI","SI","D2","D2.4",172550,7100,"stimata","TIVOLI","NO","Lavori in corso","2018",null,null,null,null,null,0,null,165332.9,null,71493.77,null,650000,null,1950000,null,650000,null,1950000,null,1577875,null,0,null,4177875,0]
[null,498,"COLLEGAMENTO A ROMA EST DEL DEPURATORE DI BORGONOVO","NO","D2","D2.4",172550,33800,"stimata","TIVOLI","NO","Scheda progetto","OLTRE 2019",null,null,null,null,null,0,null,0,null,0,null,0,null,0,null,0,null,0,null,0,null,1000000,null,1000000,0]
[null,499,"ELIMINAZIONE DEPURATORE ARCI","NO","D2","D2.4",172550,1000,"rilevata","TIVOLI","SI","Lavori in corso","2018",null,null,null,null,null,0,null,546.75,null,0,null,0,null,0,null,0,null,828750,null,828750,null,0,null,1657500,0]
[null,500,"SPOSTAMENTO PUNTO DI RECAPITO SCARICO DEPURATORE VACCARECCE","NO","D6","D6.3",1170200,350,"stimata","BELLEGRA","NO","Scheda progetto","2016",null,null,null,null,null,0,null,0,null,9736.3700000000008,null,0,null,0,null,40000,null,0,null,0,null,0,null,40000,0]
[null,501,"ADEGUAMENTO DEPURATORE PROTEZIONE CIVILE E PROLUNGAMENTO DELLO SCARICO AL TEVERE","SI","D6","D6.3",1170200,3500,"rilevata","CASTELNUOVO DI PORTO","SI","Lavori Aggiudicati","2017",null,null,null,null,null,0,null,361.68,null,67445.33,null,1836250,null,0,null,2000000,null,486250,null,0,null,0,null,2486250,0]
[null,502,"SPOSTAMENTO PUNTO DI SCARICO DEPURATORE VALLE DEI MORTI","NO","D6","D6.3",1170200,10000,"stimata","MARINO","NO","Scheda progetto","2016",null,null,null,null,null,0,null,null,null,null,null,0,null,0,null,175500,null,0,null,0,null,0,null,175500,0]
[null,503,"OPERE DI CONSOLIDAMENTO DEPURATORE SCOPPIO","NO","D6","D6.3",1170200,18000,"stimata","MONTEROTONDO","NO","Scheda progetto","2017",null,null,null,null,null,0,null,165505,null,98547.58,null,0,null,0,null,0,null,500000,null,0,null,0,null,500000,0]
[null,504,"SPOSTAMENTO PUNTO DI RECAPITO SCARICO DEPURATORE MONTE BELLONI ","NO","D6","D6.3",1170200,250,"stimata","OLEVANO ROMANO","NO","Scheda progetto","2016",null,null,null,null,null,0,null,0,null,6979.1,null,0,null,0,null,100000,null,0,null,0,null,0,null,100000,0]
[null,505,"ADEGUAMENTO DEPURATORE VIVARO","SI","D6","D6.3",1170200,400,"rilevata","ROCCA DI PAPA","SI","Lavori in corso","2016",null,null,null,null,null,0,null,384262.8,null,502649.9,null,0,null,0,null,39546.800000000003,null,0,null,0,null,0,null,39546.800000000003,0]
[null,506,"REALIZZAZIONE DEL NUOVO DEPOSITO TEMPORANEO DEI RIFIUTI PRESSO L’IMPIANTO DI ROMA SUD","NO","D6","D6.3",1170200,null,null,"ROMA","NO","Scheda progetto","2017",null,null,null,null,null,0,null,0,null,0,null,0,null,0,null,0,null,800000,null,0,null,0,null,800000,0]
[null,507,"RIFACIMENTO QUADRI ELETTRICI BT CABINE 2 E 5 DI ROMA SUD","NO","D6","D6.3",1170200,null,null,"ROMA","NO","Scheda progetto","2017",null,null,null,null,null,0,null,0,null,0,null,0,null,0,null,0,null,700000,null,0,null,0,null,700000,0]
[null,508,"OPERE DI COMPENSAZIONE AMBIENTALE ROMA SUD","NO","D6","D6.3",1170200,1100000,"stimata","Roma_9-ex12","NO","Scheda progetto","OLTRE 2019",null,null,null,null,null,0,null,0,null,0,null,0,null,0,null,0,null,0,null,0,null,2000000,null,2000000,0]
[null,509,"ADEGUAMENTO DEPURATORE SANTA MARINELLA CENTRO","NO","D6","D6.3",1170200,20000,"rilevata","SANTA MARINELLA","NO","Scheda progetto","2018",null,null,null,null,null,0,null,0,null,0,null,0,null,0,null,0,null,270562.5,null,811687.5,null,0,null,1082250,0]
[null,510,"RISTRUTTURAZIONE E ADEGUAMENTO DEPURATORE VALLE MAGGESE","SI","D6","D6.3",1170200,6000,"rilevata","SANT'ORESTE","SI","Lavori in corso","2017",null,null,null,null,null,0,null,361.68,null,25404.31,null,1950000,null,846495,null,846495,null,1950000,null,0,null,0,null,2796495,0]
[null,511,"OPERE DI CONSOLIDAMENTO DEPURATORE POZZO","NO","D6","D6.3",1170200,1700,"rilevata","TOLFA","NO","Scheda progetto","2017",null,null,null,null,null,0,null,null,null,null,null,0,null,0,null,109687.5,null,109687.5,null,0,null,0,null,219375,0]
[null,512,"INTERVENTI DEPURATORE VIA KENNEDY PER RILASCIO AUTORIZZAZIONE EMISSIONI IN ATMOSFERA","NO","D6","D6.3",1170200,10000,"stimata","VALMONTONE","NO","Scheda progetto","2016",null,null,null,null,null,0,null,null,null,null,null,0,null,0,null,68250,null,0,null,0,null,0,null,68250,0]
[null,513,"MODIFICAZIONE SISTEMA BIOLOGICO DEPURATORE COBIS","NO","M4",null,2600000,90000,"stimata","INTERCOMUNALE","SI","Progetto definitivo","2016",null,null,null,null,null,0,null,0,null,null,null,0,null,0,null,300000,null,0,null,0,null,0,null,300000,0]
[null,514,"SOSTITUZIONE POMPE  C.I. CASILINO","NO","M4",null,2600000,250000,"stimata","ROMA","NO","Scheda progetto","2016",null,null,null,null,null,0,null,null,null,null,null,0,null,0,null,500000,null,0,null,0,null,0,null,500000,0]
[null,515,"SOSTITUZIONE POMPE  C.I. TORRENOVA","NO","M4",null,2600000,100000,"stimata","ROMA","NO","Scheda progetto","2016",null,null,null,null,null,0,null,null,null,null,null,0,null,0,null,500000,null,0,null,0,null,0,null,500000,0]
[null,516,"DEPURATORE ROMA EST - INTERVENTI DI OTTIMIZZAZIONE ENERGETICA DEL COMPARTO DI OSSIDAZIONE","NO","M4",null,2600000,900000,"stimata","ROMA","SI","Progetto definitivo","2016",null,null,null,null,null,0,null,0,null,0,null,0,null,0,null,800000,null,0,null,0,null,0,null,800000,0]
[null,517,"SOSTITUZIONE TRASFORMATORI DEPURATORE ROMA SUD","NO","M4",null,2600000,null,null,"ROMA","NO","Scheda progetto","2016",null,null,null,null,null,0,null,0,null,null,null,0,null,0,null,350000,null,0,null,0,null,0,null,350000,0]
[null,518,"SOSTITUZIONE POMPE SOLLEVAMENTI MAGLIANA E MAGLIANELLA","NO","M4",null,2600000,500000,"stimata","ROMA","NO","Scheda progetto","2016",null,null,null,null,null,0,null,null,null,null,null,0,null,0,null,1200000,null,0,null,0,null,0,null,1200000,0]
[null,519,"DEPURATORE ROMA SUD - INTERVENTI DI OTTIMIZZAZIONE ENERGETICA DEL COMPARTO DI OSSIDAZIONE","NO","M4",null,2600000,1100000,"stimata","RomaSud","NO","Scheda progetto","OLTRE 2019",null,null,null,null,null,0,null,0,null,130557.6,null,0,null,0,null,0,null,0,null,0,null,1000000,null,1000000,0]
[null,520,"DEPURATORE ROMA NORD - INTERVENTI DI OTTIMIZZAZIONE ENERGETICA DEL COMPARTO DI OSSIDAZIONE","NO","M4",null,2600000,780000,"stimata","RomaSud","NO","Progetto definitivo","2018",null,null,null,null,null,0,null,0,null,23524.65,null,0,null,0,null,0,null,1500000,null,1425000,null,0,null,2925000,0]
[null,521,"MANTENIMENTO A NUOVO CONTATORI","SI","B10","B10.2",3600000,3600000,"rilevata","territorio dell'ATO 2","N.A.","lavori in corso",null,null,null,null,null,null,225000,null,null,null,null,null,2800000,null,2800000,null,4500000,null,6000000,null,6000000,null,6000000,null,22500000,0]
[null,522,"TELECONTROLLO","NO","M1","M1.1",3600000,3600000,"rilevata","territorio dell'ATO 2","N.A.","lavori in corso",null,null,null,null,null,null,0.6,null,null,null,null,null,null,null,null,null,6150000,null,8900000,null,6100000,null,5001000,null,26151000,0]
[null,523,"INTERVENTI DI MANUTENZIONE STRAORDINARIA","SI","M5","M5.1",3600000,3600000,"rilevata","territorio dell'ATO 2","NO","lavori in corso",null,null,null,null,null,null,0,null,null,null,null,null,40000000,null,40000000,null,30000000,null,30000000,null,30000000,null,30000000,null,120000000,0]
[null,524,"PROGETTI INFORMATICI","SI","M5","M5.1",3600000,3600000,"rilevata","territorio dell'ATO 2","N.A.","lavori in corso",null,null,null,null,null,null,0,null,null,null,null,null,4200000,null,2700000,null,16079129.35,null,8525986.5800000001,null,5452567.3099999996,null,6084352.25,null,36142035.489999995,0]
[null,525,"ALTRI CAPEX","SI","M5","M5.1",3600000,3600000,"rilevata","territorio dell'ATO 2","NO",null,null,null,null,null,null,null,0,null,null,null,null,null,20000000,null,16000000,null,14000000,null,17880000,null,10000000,null,10000000,null,51880000,0]